scons: Reading SConscript files ...
********** Configuring Build Target = psp / Debug ********
scons: done reading SConscript files.
scons: Building targets ...
/home/matthias/psp/chain/bin/psp-g++ -o Build/Targets/psp/Debug/ThirdParty/Neptune/Source/System/PSP/NptPSPNetwork.o -c -pedantic -g -Werror -Wall -W -Wundef -Wno-long-long -D_REENTRANT -DNPT_DEBUG -DPLT_LOG -ITp
ThirdParty/Neptune/Source/System/PSP/NptPSPNetwork.cpp: In static member function 'static NPT_Result NPT_NetworkInterface::GetNetworkInterfaces(NPT_List<NPT_NetworkInterface*>&)':
ThirdParty/Neptune/Source/System/PSP/NptPSPNetwork.cpp:21: error: aggregate 'SceNetApctlInfo info' has incomplete type and cannot be defined
ThirdParty/Neptune/Source/System/PSP/NptPSPNetwork.cpp:22: error: 'SCE_NET_APCTL_INFO_IP_ADDRESS' was not declared in this scope
ThirdParty/Neptune/Source/System/PSP/NptPSPNetwork.cpp:22: error: 'sceNetApctlGetInfo' was not declared in this scope
ThirdParty/Neptune/Source/System/PSP/NptPSPNetwork.cpp:42: error: 'SceNetEtherAddr' was not declared in this scope
ThirdParty/Neptune/Source/System/PSP/NptPSPNetwork.cpp:42: error: expected `;' before 'mac_info'
ThirdParty/Neptune/Source/System/PSP/NptPSPNetwork.cpp:43: error: 'mac_info' was not declared in this scope
ThirdParty/Neptune/Source/System/PSP/NptPSPNetwork.cpp:43: error: 'sceNetGetLocalEtherAddr' was not declared in this scope
ThirdParty/Neptune/Source/System/PSP/NptPSPNetwork.cpp:47: error: 'TYPE_IEEE_802_11' was not declared in this scope
ThirdParty/Neptune/Source/System/PSP/NptPSPNetwork.cpp:47: error: 'SCE_NET_ETHER_ADDR_LEN' was not declared in this scope
scons: *** [Build/Targets/psp/Debug/ThirdParty/Neptune/Source/System/PSP/NptPSPNetwork.o] Error 1
scons: building terminated because of errors.