ast_h323.h: In member function `virtual int MyH323_ExternalRTPChannel::InternalIsDescendant(const char*) const':
ast_h323.h:126: error: `H323_ExternalRTPChannel' has not been declared
ast_h323.h: In member function `virtual const char* MyH323_ExternalRTPChannel::GetClass(unsigned int) const':
ast_h323.h:126: error: `H323_ExternalRTPChannel' has not been declared
In file included from ast_h323.h:164,
from ast_h323.cxx:61:
compat_h323.h: At global scope:
compat_h323.h:10: error: expected class-name before '{' token
compat_h323.h:11: error: `Comparison' does not name a type
compat_h323.h:15: error: expected `)' before '&' token
compat_h323.h: In member function `virtual int MyH323TransportTCP::InternalIsDescendant(const char*) const':
compat_h323.h:11: error: `H323TransportTCP' has not been declared
compat_h323.h: In member function `virtual const char* MyH323TransportTCP::GetClass(unsigned int) const':
compat_h323.h:11: error: `H323TransportTCP' has not been declared
compat_h323.h: At global scope:
compat_h323.h:28: error: expected class-name before '{' token
compat_h323.h:29: error: `Comparison' does not name a type
compat_h323.h:32: error: expected `)' before '&' token
compat_h323.h:38: error: `H323Gatekeeper' has not been declared
compat_h323.h:39: error: `H323RasPDU' has not been declared
compat_h323.h:40: error: expected `,' or `...' before '&' token
compat_h323.h:40: error: ISO C++ forbids declaration of `parameter' with no type
compat_h323.h:40: error: ISO C++ forbids declaration of `parameter' with no type
compat_h323.h:40: error: ISO C++ forbids declaration of `H323TransportAddress' with no type
compat_h323.h:43: error: ISO C++ forbids declaration of `H323Gatekeeper' with no type
compat_h323.h:43: error: expected `;' before '*' token
compat_h323.h:44: error: ISO C++ forbids declaration of `H323RasPDU' with no type
compat_h323.h:44: error: expected `;' before '*' token
compat_h323.h:45: error: ISO C++ forbids declaration of `H323TransportAddress' with no type
compat_h323.h:45: error: expected `;' before '*' token
compat_h323.h:28: warning: `class MyH323TransportUDP' has virtual functions but non-virtual destructor
compat_h323.h: In member function `virtual int MyH323TransportUDP::InternalIsDescendant(const char*) const':
compat_h323.h:29: error: `H323TransportUDP' has not been declared
compat_h323.h: In member function `virtual const char* MyH323TransportUDP::GetClass(unsigned int) const':
compat_h323.h:29: error: `H323TransportUDP' has not been declared
In file included from ast_h323.cxx:63:
caps_h323.h: At global scope:
caps_h323.h:7: error: expected class-name before '{' token
caps_h323.h:8: error: `Comparison' does not name a type
caps_h323.h:11: error: `H323_G711Capability' has not been declared
caps_h323.h:11: error: `Mode' has not been declared
caps_h323.h:11: error: `H323_G711Capability' has not been declared
caps_h323.h:11: error: `Speed' has not been declared
caps_h323.h:11: error: ISO C++ forbids declaration of `_mode' with no type
caps_h323.h:11: error: ISO C++ forbids declaration of `_speed' with no type
caps_h323.h:13: error: ISO C++ forbids declaration of `H323Codec' with no type
caps_h323.h:13: error: `H323Codec' declared as a `virtual' field
caps_h323.h:13: error: expected `;' before '*' token
caps_h323.h:18: error: `H323_G711Capability' has not been declared
caps_h323.h:18: error: ISO C++ forbids declaration of `Mode' with no type
caps_h323.h:18: error: expected `;' before "mode"
caps_h323.h:19: error: `H323_G711Capability' has not been declared
caps_h323.h:19: error: ISO C++ forbids declaration of `Speed' with no type
caps_h323.h:19: error: expected `;' before "speed"
caps_h323.h:11: error: `H323_G711Capability' has not been declared
caps_h323.h:11: error: `muLaw' was not declared in this scope
caps_h323.h:11: error: `H323_G711Capability' has not been declared
caps_h323.h:11: error: `At64k' was not declared in this scope
caps_h323.h: In member function `virtual int AST_G711Capability::InternalIsDescendant(const char*) const':
caps_h323.h:8: error: `H323AudioCapability' has not been declared
caps_h323.h: In member function `virtual const char* AST_G711Capability::GetClass(unsigned int) const':
caps_h323.h:8: error: `H323AudioCapability' has not been declared
caps_h323.h: At global scope:
caps_h323.h:25: error: expected class-name before '{' token
caps_h323.h:26: error: `Comparison' does not name a type
caps_h323.h:30: error: `Comparison' does not name a type
caps_h323.h:32: error: ISO C++ forbids declaration of `H323Codec' with no type
caps_h323.h:32: error: `H323Codec' declared as a `virtual' field
caps_h323.h:32: error: expected `;' before '*' token
caps_h323.h:35: error: `H245_AudioCapability' has not been declared
caps_h323.h:35: error: ISO C++ forbids declaration of `pdu' with no type
caps_h323.h:36: error: expected `,' or `...' before '&' token
caps_h323.h:36: error: ISO C++ forbids declaration of `H245_AudioCapability' with no type
caps_h323.h: In member function `virtual int AST_G7231Capability::InternalIsDescendant(const char*) const':
caps_h323.h:26: error: `H323AudioCapability' has not been declared
caps_h323.h: In member function `virtual const char* AST_G7231Capability::GetClass(unsigned int) const':
caps_h323.h:26: error: `H323AudioCapability' has not been declared
caps_h323.h: At global scope:
caps_h323.h:45: error: expected class-name before '{' token
caps_h323.h:46: error: `Comparison' does not name a type
caps_h323.h:54: error: ISO C++ forbids declaration of `H323Codec' with no type
caps_h323.h:54: error: `H323Codec' declared as a `virtual' field
caps_h323.h:54: error: expected `;' before '*' token
caps_h323.h: In member function `virtual int AST_G729Capability::InternalIsDescendant(const char*) const':
caps_h323.h:46: error: `H323AudioCapability' has not been declared
caps_h323.h: In member function `virtual const char* AST_G729Capability::GetClass(unsigned int) const':
caps_h323.h:46: error: `H323AudioCapability' has not been declared
caps_h323.h: At global scope:
caps_h323.h:69: error: expected class-name before '{' token
caps_h323.h:70: error: `Comparison' does not name a type
caps_h323.h:79: error: ISO C++ forbids declaration of `H323Codec' with no type
caps_h323.h:79: error: `H323Codec' declared as a `virtual' field
caps_h323.h:79: error: expected `;' before '*' token
caps_h323.h: In member function `virtual int AST_G729ACapability::InternalIsDescendant(const char*) const':
caps_h323.h:70: error: `H323AudioCapability' has not been declared
caps_h323.h: In member function `virtual const char* AST_G729ACapability::GetClass(unsigned int) const':
caps_h323.h:70: error: `H323AudioCapability' has not been declared
caps_h323.h: At global scope:
caps_h323.h:94: error: expected class-name before '{' token
caps_h323.h:95: error: `Comparison' does not name a type
caps_h323.h:105: error: ISO C++ forbids declaration of `H323Codec' with no type
caps_h323.h:105: error: `H323Codec' declared as a `virtual' field
caps_h323.h:105: error: expected `;' before '*' token
caps_h323.h:117: error: `H245_AudioCapability' has not been declared
caps_h323.h:117: error: ISO C++ forbids declaration of `pdu' with no type
caps_h323.h:118: error: expected `,' or `...' before '&' token
caps_h323.h:118: error: ISO C++ forbids declaration of `H245_AudioCapability' with no type
caps_h323.h: In member function `virtual int AST_GSM0610Capability::InternalIsDescendant(const char*) const':
caps_h323.h:95: error: `H323AudioCapability' has not been declared
caps_h323.h: In member function `virtual const char* AST_GSM0610Capability::GetClass(unsigned int) const':
caps_h323.h:95: error: `H323AudioCapability' has not been declared
ast_h323.cxx: In member function `virtual void MyProcess::Main()':
ast_h323.cxx:212: error: 'class MyH323EndPoint' has no member named 'SetInitialBandwidth'
ast_h323.cxx: In constructor `MyH323EndPoint::MyH323EndPoint()':
ast_h323.cxx:225: error: class `MyH323EndPoint' does not have any field named `H323EndPoint'
ast_h323.cxx:228: error: `capabilities' undeclared (first use this function)
ast_h323.cxx:228: error: (Each undeclared identifier is reported only once for each function it appears in.)
ast_h323.cxx:231: error: `signallingChannelCallTimeout' undeclared (first use this function)
ast_h323.cxx: In member function `int MyH323EndPoint::MyMakeCall(const PString&, PString&, void*, void*)':
ast_h323.cxx:245: error: `H323Transport' undeclared (first use this function)
ast_h323.cxx:245: error: `transport' undeclared (first use this function)
ast_h323.cxx:250: error: `GetGatekeeper' undeclared (first use this function)
ast_h323.cxx:261: error: `listeners' undeclared (first use this function)
ast_h323.cxx:262: error: `H323TransportAddress' undeclared (first use this function)
ast_h323.cxx:262: error: expected `;' before "taddr"
ast_h323.cxx:263: error: `PIPSocket' has not been declared
ast_h323.cxx:263: error: `Address' undeclared (first use this function)
ast_h323.cxx:263: error: expected `;' before "addr"
ast_h323.cxx:265: error: `taddr' undeclared (first use this function)
ast_h323.cxx:265: error: `addr' undeclared (first use this function)
ast_h323.cxx:278: error: `H323EndPoint' has not been declared
ast_h323.cxx:278: error: `MakeCallLocked' undeclared (first use this function)
ast_h323.cxx:284: error: 'class MyH323Connection' has no member named 'GetCallReference'
ast_h323.cxx:287: error: `GetLocalUserName' undeclared (first use this function)
ast_h323.cxx:290: error: 'class MyH323Connection' has no member named 'dtmfCodec'
ast_h323.cxx:292: error: 'class MyH323Connection' has no member named 'Unlock'
ast_h323.cxx: At global scope:
ast_h323.cxx:296: error: variable or field `SetEndpointTypeInfo' declared void
ast_h323.cxx:296: error: `int MyH323EndPoint::SetEndpointTypeInfo' is not a static member of `class MyH323EndPoint'
ast_h323.cxx:296: error: `H225_EndpointType' was not declared in this scope
ast_h323.cxx:296: error: `info' was not declared in this scope
ast_h323.cxx:296: error: expected `,' or `;' before "const"
ast_h323.cxx: In member function `void MyH323EndPoint::SetGateway()':
ast_h323.cxx:318: error: `terminalType' undeclared (first use this function)
ast_h323.cxx:318: error: `e_GatewayOnly' undeclared (first use this function)
ast_h323.cxx: At global scope:
ast_h323.cxx:321: error: `H323Connection' has not been declared
ast_h323.cxx:321: error: `CallEndReason' has not been declared
ast_h323.cxx:322: error: ISO C++ forbids declaration of `reason' with no type
ast_h323.cxx: In member function `int MyH323EndPoint::ClearCall(const PString&, int)':
ast_h323.cxx:330: error: `H323EndPoint' has not been declared
ast_h323.cxx: In member function `int MyH323EndPoint::ClearCall(const PString&)':
ast_h323.cxx:338: error: `H323EndPoint' has not been declared
ast_h323.cxx:338: error: `H323Connection' has not been declared
ast_h323.cxx:338: error: `EndedByLocalUser' undeclared (first use this function)
ast_h323.cxx: In member function `void MyH323EndPoint::SendUserTone(const PString&, char)':
ast_h323.cxx:343: error: `H323Connection' undeclared (first use this function)
ast_h323.cxx:343: error: `connection' undeclared (first use this function)
ast_h323.cxx:345: error: `FindConnectionWithLock' undeclared (first use this function)
ast_h323.cxx: At global scope:
ast_h323.cxx:352: error: variable or field `OnClosedLogicalChannel' declared void
ast_h323.cxx:352: error: `int MyH323EndPoint::OnClosedLogicalChannel' is not a static member of `class MyH323EndPoint'
ast_h323.cxx:352: error: `H323Connection' was not declared in this scope
ast_h323.cxx:352: error: `connection' was not declared in this scope
ast_h323.cxx:352: error: expected primary-expression before "const"
ast_h323.cxx:353: error: initializer expression list treated as compound expression
ast_h323.cxx:353: error: expected `,' or `;' before '{' token
ast_h323.cxx:361: error: `int MyH323EndPoint::OnConnectionForwarded' is not a static member of `class MyH323EndPoint'
ast_h323.cxx:361: error: `H323Connection' was not declared in this scope
ast_h323.cxx:361: error: `connection' was not declared in this scope
ast_h323.cxx:362: error: expected primary-expression before "const"
ast_h323.cxx:363: error: expected primary-expression before "const"
ast_h323.cxx:364: error: initializer expression list treated as compound expression
ast_h323.cxx:364: error: expected `,' or `;' before '{' token
ast_h323.cxx:371: error: `int MyH323EndPoint::ForwardConnection' is not a static member of `class MyH323EndPoint'
ast_h323.cxx:371: error: `H323Connection' was not declared in this scope
ast_h323.cxx:371: error: `connection' was not declared in this scope
ast_h323.cxx:372: error: expected primary-expression before "const"
ast_h323.cxx:373: error: expected primary-expression before "const"
ast_h323.cxx:374: error: initializer expression list treated as compound expression
ast_h323.cxx:374: error: expected `,' or `;' before '{' token
ast_h323.cxx:381: error: variable or field `OnConnectionEstablished' declared void
ast_h323.cxx:381: error: `int MyH323EndPoint::OnConnectionEstablished' is not a static member of `class MyH323EndPoint'
ast_h323.cxx:381: error: `H323Connection' was not declared in this scope
ast_h323.cxx:381: error: `connection' was not declared in this scope
ast_h323.cxx:381: error: expected primary-expression before "const"
ast_h323.cxx:382: error: initializer expression list treated as compound expression
ast_h323.cxx:382: error: expected `,' or `;' before '{' token
ast_h323.cxx:393: error: variable or field `OnConnectionCleared' declared void
ast_h323.cxx:393: error: `int MyH323EndPoint::OnConnectionCleared' is not a static member of `class MyH323EndPoint'
ast_h323.cxx:393: error: `H323Connection' was not declared in this scope
ast_h323.cxx:393: error: `connection' was not declared in this scope
ast_h323.cxx:393: error: expected primary-expression before "const"
ast_h323.cxx:394: error: initializer expression list treated as compound expression
ast_h323.cxx:394: error: expected `,' or `;' before '{' token
ast_h323.cxx:503: error: expected constructor, destructor, or type conversion before '*' token
ast_h323.cxx:503: error: expected `,' or `;' before '*' token
ast_h323.cxx: In constructor `MyH323Connection::MyH323Connection(MyH323EndPoint&, unsigned int, unsigned int)':
ast_h323.cxx:538: error: class `MyH323Connection' does not have any field named `H323Connection'
ast_h323.cxx:545: error: `dtmfCodec' undeclared (first use this function)
ast_h323.cxx:545: error: `RTP_DataFrame' has not been declared
ast_h323.cxx:545: error: `PayloadTypes' undeclared (first use this function)
ast_h323.cxx:545: error: expected `;' before numeric constant
ast_h323.cxx: At global scope:
ast_h323.cxx:565: error: expected `,' or `...' before '&' token
ast_h323.cxx:566: error: ISO C++ forbids declaration of `H323SignalPDU' with no type
ast_h323.cxx: In member function `int MyH323Connection::OnReceivedProgress(int)':
ast_h323.cxx:570: error: `H323Connection' has not been declared
ast_h323.cxx:570: error: `pdu' undeclared (first use this function)
ast_h323.cxx:581: error: `Q931' has not been declared
ast_h323.cxx:581: error: `ProgressNotEndToEndISDN' undeclared (first use this function)
ast_h323.cxx:582: error: `Q931' has not been declared
ast_h323.cxx:582: error: `ProgressInbandInformationAvailable' undeclared (first use this function)
ast_h323.cxx:588: error: `GetCallReference' undeclared (first use this function)
ast_h323.cxx:588: error: `GetCallToken' undeclared (first use this function)
ast_h323.cxx:590: error: `connectionState' undeclared (first use this function)
ast_h323.cxx:590: error: `ShuttingDownConnection' undeclared (first use this function)
ast_h323.cxx: In member function `int MyH323Connection::MySendProgress()':
ast_h323.cxx:597: error: `H323SignalPDU' undeclared (first use this function)
ast_h323.cxx:597: error: expected `;' before "progressPDU"
ast_h323.cxx:598: error: `H225_Progress_UUIE' undeclared (first use this function)
ast_h323.cxx:598: error: `prog' undeclared (first use this function)
ast_h323.cxx:598: error: `progressPDU' undeclared (first use this function)
ast_h323.cxx:600: error: `mediaWaitForConnect' undeclared (first use this function)
ast_h323.cxx:601: error: `SendFastStartAcknowledge' undeclared (first use this function)
ast_h323.cxx:602: error: `H225_Progress_UUIE' has not been declared
ast_h323.cxx:602: error: `e_fastStart' undeclared (first use this function)
ast_h323.cxx:604: error: `connectionState' undeclared (first use this function)
ast_h323.cxx:604: error: `ShuttingDownConnection' undeclared (first use this function)
ast_h323.cxx:608: error: `earlyStart' undeclared (first use this function)
ast_h323.cxx:609: error: `h245Tunneling' undeclared (first use this function)
ast_h323.cxx:610: error: `H323Connection' has not been declared
ast_h323.cxx:610: error: no matching function for call to `MyH323Connection::StartControlChannel()'
ast_h323.h:90: note: candidates are: virtual int MyH323Connection::StartControlChannel(int)
ast_h323.cxx:612: error: `H225_Progress_UUIE' has not been declared
ast_h323.cxx:612: error: `e_h245Address' undeclared (first use this function)
ast_h323.cxx:613: error: `controlChannel' undeclared (first use this function)
ast_h323.cxx:617: error: `Q931' has not been declared
ast_h323.cxx:617: error: `ProgressInbandInformationAvailable' undeclared (first use this function)
ast_h323.cxx:622: error: `HandleTunnelPDU' undeclared (first use this function)
ast_h323.cxx:623: error: `WriteSignalPDU' undeclared (first use this function)
ast_h323.cxx: At global scope:
ast_h323.cxx:628: error: `H323Connection' has not been declared
ast_h323.cxx:628: error: expected constructor, destructor, or type conversion before "MyH323Connection"
ast_h323.cxx:628: error: expected `,' or `;' before "MyH323Connection"
ast_h323.cxx:673: error: expected `,' or `...' before '&' token
ast_h323.cxx:674: error: ISO C++ forbids declaration of `H323SignalPDU' with no type
ast_h323.cxx: In member function `int MyH323Connection::OnAlerting(int)':
ast_h323.cxx:676: error: `GetCallReference' undeclared (first use this function)
ast_h323.cxx:678: error: `username' undeclared (first use this function)
ast_h323.cxx:685: error: `alertingPDU' undeclared (first use this function)
ast_h323.cxx:693: error: `Q931' has not been declared
ast_h323.cxx:693: error: `ProgressNotEndToEndISDN' undeclared (first use this function)
ast_h323.cxx:694: error: `Q931' has not been declared
ast_h323.cxx:694: error: `ProgressInbandInformationAvailable' undeclared (first use this function)
ast_h323.cxx:700: error: `GetCallToken' undeclared (first use this function)
ast_h323.cxx:703: error: `connectionState' undeclared (first use this function)
ast_h323.cxx:703: error: `ShuttingDownConnection' undeclared (first use this function)
ast_h323.cxx: In member function `void MyH323Connection::SetCallOptions(void*, int)':
ast_h323.cxx:712: error: `dtmfCodec' undeclared (first use this function)
ast_h323.cxx:712: error: `RTP_DataFrame' has not been declared
ast_h323.cxx:712: error: `PayloadTypes' undeclared (first use this function)
ast_h323.cxx:712: error: expected `;' before "opts"
ast_h323.cxx:716: error: `fastStartState' undeclared (first use this function)
ast_h323.cxx:716: error: `FastStartInitiate' undeclared (first use this function)
ast_h323.cxx:716: error: `FastStartDisabled' undeclared (first use this function)
ast_h323.cxx:717: error: `h245Tunneling' undeclared (first use this function)
ast_h323.cxx:719: error: `SetLocalPartyName' undeclared (first use this function)
ast_h323.cxx:720: error: `SetDisplayName' undeclared (first use this function)
ast_h323.cxx: At global scope:
ast_h323.cxx:734: error: expected `,' or `...' before '&' token
ast_h323.cxx:735: error: ISO C++ forbids declaration of `H323SignalPDU' with no type
ast_h323.cxx: In member function `void MyH323Connection::SetCallDetails(void*, int)':
ast_h323.cxx:744: error: `GetCallReference' undeclared (first use this function)
ast_h323.cxx:745: error: `GetCallToken' undeclared (first use this function)
ast_h323.cxx:748: error: `setupPDU' undeclared (first use this function)
ast_h323.cxx:756: error: `isIncoming' undeclared (first use this function)
ast_h323.cxx:758: error: `PIPSocket' has not been declared
ast_h323.cxx:758: error: `Address' undeclared (first use this function)
ast_h323.cxx:758: error: expected `;' before "Ip"
ast_h323.cxx:763: error: `Q931' has not been declared
ast_h323.cxx:763: error: `InformationTransferCapability' undeclared (first use this function)
ast_h323.cxx:763: error: expected `;' before "capability"
ast_h323.cxx:774: error: `Q931' has not been declared
ast_h323.cxx:774: error: `UserUserIE' undeclared (first use this function)
ast_h323.cxx:775: error: expected primary-expression before "const"
ast_h323.cxx:775: error: expected `;' before "const"
ast_h323.cxx:776: error: `setup_uuie' undeclared (first use this function)
ast_h323.cxx:776: error: `H225_Setup_UUIE' has not been declared
ast_h323.cxx:776: error: `e_presentationIndicator' undeclared (first use this function)
ast_h323.cxx:778: error: `H225_Setup_UUIE' has not been declared
ast_h323.cxx:778: error: `e_screeningIndicator' undeclared (first use this function)
ast_h323.cxx:789: error: `GetSignallingChannel' undeclared (first use this function)
ast_h323.cxx:789: error: `Ip' undeclared (first use this function)
ast_h323.cxx:800: error: `Q931' undeclared (first use this function)
ast_h323.cxx:800: error: expected primary-expression before ')' token
ast_h323.cxx:800: error: expected `)' before "setupPDU"
ast_h323.cxx:801: error: expected `)' before ';' token
ast_h323.cxx:806: error: `SetDisplayName' undeclared (first use this function)
ast_h323.cxx:764: warning: unused variable 'transferRate'
ast_h323.cxx:764: warning: unused variable 'codingStandard'
ast_h323.cxx:764: warning: unused variable 'userInfoLayer1'
ast_h323.cxx: At global scope:
ast_h323.cxx:829: error: `Q931' was not declared in this scope
ast_h323.cxx:829: error: `q931' was not declared in this scope
ast_h323.cxx:829: error: expected primary-expression before "const"
ast_h323.cxx:830: error: initializer expression list treated as compound expression
ast_h323.cxx:830: error: expected `,' or `;' before '{' token
ast_h323.cxx:887: error: `Q931' was not declared in this scope
ast_h323.cxx:887: error: `q931' was not declared in this scope
ast_h323.cxx:887: error: expected primary-expression before "const"
ast_h323.cxx:888: error: initializer expression list treated as compound expression
ast_h323.cxx:888: error: expected `,' or `;' before '{' token
ast_h323.cxx:931: error: `H323SignalPDU' was not declared in this scope
ast_h323.cxx:931: error: `pdu' was not declared in this scope
ast_h323.cxx:932: error: expected `,' or `;' before '{' token
ast_h323.cxx:1001: error: `Q931' was not declared in this scope
ast_h323.cxx:1001: error: `q931' was not declared in this scope
ast_h323.cxx:1001: error: expected primary-expression before "const"
ast_h323.cxx:1002: error: initializer expression list treated as compound expression
ast_h323.cxx:1002: error: expected `,' or `;' before '{' token
ast_h323.cxx:1028: error: expected init-declarator before '*' token
ast_h323.cxx:1028: error: expected `,' or `;' before '*' token
ast_h323.cxx:1051: error: `H323SignalPDU' was not declared in this scope
ast_h323.cxx:1051: error: `pdu' was not declared in this scope
ast_h323.cxx:1052: error: expected `,' or `;' before '{' token
ast_h323.cxx:1070: error: `H323SignalPDU' was not declared in this scope
ast_h323.cxx:1070: error: `pdu' was not declared in this scope
ast_h323.cxx:1071: error: expected `,' or `;' before '{' token
ast_h323.cxx:1127: error: `int MyH323Connection::EmbedTunneledInfo' is not a static member of `class MyH323Connection'
ast_h323.cxx:1127: error: `H323SignalPDU' was not declared in this scope
ast_h323.cxx:1127: error: `pdu' was not declared in this scope
ast_h323.cxx:1128: error: expected `,' or `;' before '{' token
ast_h323.cxx:1138: error: `int MyH323Connection::HandleSignalPDU' is not a static member of `class MyH323Connection'
ast_h323.cxx:1138: error: `H323SignalPDU' was not declared in this scope
ast_h323.cxx:1138: error: `pdu' was not declared in this scope
ast_h323.cxx:1139: error: expected `,' or `;' before '{' token
ast_h323.cxx:1173: error: expected `,' or `...' before '&' token
ast_h323.cxx:1174: error: ISO C++ forbids declaration of `H323SignalPDU' with no type
ast_h323.cxx: In member function `int MyH323Connection::OnReceivedSignalSetup(int)':
ast_h323.cxx:1181: error: `connectionState' undeclared (first use this function)
ast_h323.cxx:1181: error: `ShuttingDownConnection' undeclared (first use this function)
ast_h323.cxx:1184: error: `setupPDU' undeclared (first use this function)
ast_h323.cxx:1199: error: `h245Tunneling' undeclared (first use this function)
ast_h323.cxx:1200: error: `masterSlaveDeterminationProcedure' undeclared (first use this function)
ast_h323.cxx:1201: error: `capabilityExchangeProcedure' undeclared (first use this function)
ast_h323.cxx:1206: error: `H323Connection' has not been declared
ast_h323.cxx: At global scope:
ast_h323.cxx:1209: error: `int MyH323Connection::OnSendSignalSetup' is not a static member of `class MyH323Connection'
ast_h323.cxx:1209: error: `H323SignalPDU' was not declared in this scope
ast_h323.cxx:1209: error: `setupPDU' was not declared in this scope
ast_h323.cxx:1210: error: expected `,' or `;' before '{' token
ast_h323.cxx:1259: error: expected `,' or `...' before '&' token
ast_h323.cxx:1262: error: ISO C++ forbids declaration of `H323Channel' with no type
ast_h323.cxx: In function `int BuildFastStartList(int)':
ast_h323.cxx:1263: error: `H245_OpenLogicalChannel' undeclared (first use this function)
ast_h323.cxx:1263: error: expected `;' before "open"
ast_h323.cxx:1264: error: expected primary-expression before "const"
ast_h323.cxx:1264: error: expected `;' before "const"
ast_h323.cxx:1266: error: `channel' undeclared (first use this function)
ast_h323.cxx:1266: error: `reverseDirection' undeclared (first use this function)
ast_h323.cxx:1267: error: `capability' undeclared (first use this function)
ast_h323.cxx:1267: error: request for member `m_forwardLogicalChannelParameters' in `open', which is of non-class type `int ()(const char*, int, ...)'
ast_h323.cxx:1271: error: request for member `m_reverseLogicalChannelParameters' in `open', which is of non-class type `int ()(const char*, int, ...)'
ast_h323.cxx:1274: error: request for member `m_forwardLogicalChannelParameters' in `open', which is of non-class type `int ()(const char*, int, ...)'
ast_h323.cxx:1275: error: `H245_OpenLogicalChannel_forwardLogicalChannelParameters_multiplexParameters' has not been declared
ast_h323.cxx:1275: error: `e_none' undeclared (first use this function)
ast_h323.cxx:1276: error: request for member `m_forwardLogicalChannelParameters' in `open', which is of non-class type `int ()(const char*, int, ...)'
ast_h323.cxx:1276: error: `H245_DataType' has not been declared
ast_h323.cxx:1276: error: `e_nullData' undeclared (first use this function)
ast_h323.cxx:1277: error: request for member `IncludeOptionalField' in `open', which is of non-class type `int ()(const char*, int, ...)'
ast_h323.cxx:1277: error: `H245_OpenLogicalChannel' has not been declared
ast_h323.cxx:1277: error: `e_reverseLogicalChannelParameters' undeclared (first use this function)
ast_h323.cxx:1283: warning: the address of `int open(const char*, int, ...)', will always evaluate as `true'
ast_h323.cxx:1284: error: `array' undeclared (first use this function)
ast_h323.cxx: At global scope:
ast_h323.cxx:1292: error: `H323Connection' has not been declared
ast_h323.cxx:1292: error: expected constructor, destructor, or type conversion before "MyH323Connection"
ast_h323.cxx:1292: error: expected `,' or `;' before "MyH323Connection"
ast_h323.cxx:1564: error: `int MyH323Connection::OnSendReleaseComplete' is not a static member of `class MyH323Connection'
ast_h323.cxx:1564: error: `H323SignalPDU' was not declared in this scope
ast_h323.cxx:1564: error: `releaseCompletePDU' was not declared in this scope
ast_h323.cxx:1565: error: expected `,' or `;' before '{' token
ast_h323.cxx:1579: error: expected `,' or `...' before '&' token
ast_h323.cxx:1580: error: ISO C++ forbids declaration of `H323SignalPDU' with no type
ast_h323.cxx: In member function `int MyH323Connection::OnReceivedFacility(int)':
ast_h323.cxx:1584: error: `H323Connection' has not been declared
ast_h323.cxx:1584: error: `pdu' undeclared (first use this function)
ast_h323.cxx: At global scope:
ast_h323.cxx:1587: error: expected `,' or `...' before '&' token
ast_h323.cxx:1588: error: ISO C++ forbids declaration of `H323SignalPDU' with no type
ast_h323.cxx: In member function `void MyH323Connection::OnReceivedReleaseComplete(int)':
ast_h323.cxx:1593: error: `GetCallReference' undeclared (first use this function)
ast_h323.cxx:1593: error: `GetCallToken' undeclared (first use this function)
ast_h323.cxx:1593: error: `pdu' undeclared (first use this function)
ast_h323.cxx:1594: error: `H323Connection' has not been declared
ast_h323.cxx:1594: error: return-statement with a value, in function returning 'void'
ast_h323.cxx: At global scope:
ast_h323.cxx:1597: error: `int MyH323Connection::OnClosingLogicalChannel' is not a static member of `class MyH323Connection'
ast_h323.cxx:1597: error: `H323Channel' was not declared in this scope
ast_h323.cxx:1597: error: `channel' was not declared in this scope
ast_h323.cxx:1598: error: expected `,' or `;' before '{' token
ast_h323.cxx: In member function `virtual void MyH323Connection::SendUserInputTone(char, unsigned int, unsigned int, unsigned int)':
ast_h323.cxx:1607: error: `SendUserInputModes' undeclared (first use this function)
ast_h323.cxx:1607: error: expected `;' before "mode"
ast_h323.cxx:1610: error: `mode' undeclared (first use this function)
ast_h323.cxx:1610: error: `SendUserInputAsTone' undeclared (first use this function)
ast_h323.cxx:1610: error: `SendUserInputAsInlineRFC2833' undeclared (first use this function)
ast_h323.cxx:1614: error: `H323Connection' has not been declared
ast_h323.cxx: In member function `virtual void MyH323Connection::OnUserInputTone(char, unsigned int, unsigned int, unsigned int)':
ast_h323.cxx:1624: error: `GetCallReference' undeclared (first use this function)
ast_h323.cxx:1624: error: `GetCallToken' undeclared (first use this function)
ast_h323.cxx: In member function `virtual void MyH323Connection::OnUserInputString(const PString&)':
ast_h323.cxx:1633: error: `GetCallReference' undeclared (first use this function)
ast_h323.cxx:1633: error: `GetCallToken' undeclared (first use this function)
ast_h323.cxx: At global scope:
ast_h323.cxx:1636: error: variable or field `OnSendCapabilitySet' declared void
ast_h323.cxx:1636: error: `int MyH323Connection::OnSendCapabilitySet' is not a static member of `class MyH323Connection'
ast_h323.cxx:1636: error: `H245_TerminalCapabilitySet' was not declared in this scope
ast_h323.cxx:1636: error: `pdu' was not declared in this scope
ast_h323.cxx:1637: error: expected `,' or `;' before '{' token
ast_h323.cxx: In member function `void MyH323Connection::OnSetLocalCapabilities()':
ast_h323.cxx:1664: error: `GetCallReference' undeclared (first use this function)
ast_h323.cxx:1664: error: `callToken' undeclared (first use this function)
ast_h323.cxx: At global scope:
ast_h323.cxx:1667: error: expected `,' or `...' before '&' token
ast_h323.cxx:1670: error: ISO C++ forbids declaration of `H323Capabilities' with no type
ast_h323.cxx: In member function `int MyH323Connection::OnReceivedCapabilitySet(int)':
ast_h323.cxx:1677: error: `H245_AudioCapability' has not been declared
ast_h323.cxx:1677: error: `e_g7231' undeclared (first use this function)
ast_h323.cxx:1678: error: `H245_AudioCapability' has not been declared
ast_h323.cxx:1678: error: `e_gsmFullRate' undeclared (first use this function)
ast_h323.cxx:1679: error: `H245_AudioCapability' has not been declared
ast_h323.cxx:1679: error: `e_g711Ulaw64k' undeclared (first use this function)
ast_h323.cxx:1680: error: `H245_AudioCapability' has not been declared
ast_h323.cxx:1680: error: `e_g711Alaw64k' undeclared (first use this function)
ast_h323.cxx:1681: error: `H245_AudioCapability' has not been declared
ast_h323.cxx:1681: error: `e_g729AnnexA' undeclared (first use this function)
ast_h323.cxx:1682: error: `H245_AudioCapability' has not been declared
ast_h323.cxx:1682: error: `e_g729' undeclared (first use this function)
ast_h323.cxx:1705: error: `H323Connection' has not been declared
ast_h323.cxx:1705: error: `remoteCaps' undeclared (first use this function)
ast_h323.cxx:1705: error: `muxCap' undeclared (first use this function)
ast_h323.cxx:1705: error: `reject' undeclared (first use this function)
ast_h323.cxx:1709: error: expected primary-expression before "const"
ast_h323.cxx:1709: error: expected `;' before "const"
ast_h323.cxx:1710: error: `cap' undeclared (first use this function)
ast_h323.cxx:1711: error: `RTP_DataFrame' has not been declared
ast_h323.cxx:1711: error: `PayloadTypes' undeclared (first use this function)
ast_h323.cxx:1711: error: expected `;' before "pt"
ast_h323.cxx:1712: error: `GetCallReference' undeclared (first use this function)
ast_h323.cxx:1712: error: `GetCallToken' undeclared (first use this function)
ast_h323.cxx:1712: error: `pt' undeclared (first use this function)
ast_h323.cxx:1713: error: `sendUserInputMode' undeclared (first use this function)
ast_h323.cxx:1713: error: `SendUserInputAsTone' undeclared (first use this function)
ast_h323.cxx:1714: error: `SendUserInputAsInlineRFC2833' undeclared (first use this function)
ast_h323.cxx:1721: error: `remoteCapabilities' undeclared (first use this function)
ast_h323.cxx:1727: error: `H323Capability' has not been declared
ast_h323.cxx:1727: error: `e_Audio' undeclared (first use this function)
ast_h323.cxx:1790: error: `callToken' undeclared (first use this function)
ast_h323.cxx: At global scope:
ast_h323.cxx:1795: error: expected constructor, destructor, or type conversion before '*' token
ast_h323.cxx:1795: error: expected `,' or `;' before '*' token
ast_h323.cxx:1811: error: `int MyH323Connection::OnStartLogicalChannel' is not a static member of `class MyH323Connection'
ast_h323.cxx:1811: error: `H323Channel' was not declared in this scope
ast_h323.cxx:1811: error: `channel' was not declared in this scope
ast_h323.cxx:1812: error: expected `,' or `;' before '{' token
ast_h323.cxx: In member function `void MyH323Connection::SetCapabilities(int, int, void*, int)':
ast_h323.cxx:1837: error: `localCapabilities' undeclared (first use this function)
ast_h323.cxx:1884: error: 'class AST_G729ACapability' has no member named 'SetTxFramesInPacket'
ast_h323.cxx:1885: error: 'class AST_G729Capability' has no member named 'SetTxFramesInPacket'
ast_h323.cxx:1892: error: 'class AST_G7231Capability' has no member named 'SetTxFramesInPacket'
ast_h323.cxx:1895: error: 'class AST_G7231Capability' has no member named 'SetTxFramesInPacket'
ast_h323.cxx:1901: error: 'class AST_GSM0610Capability' has no member named 'SetTxFramesInPacket'
ast_h323.cxx:1905: error: `H323_G711Capability' has not been declared
ast_h323.cxx:1905: error: `muLaw' undeclared (first use this function)
ast_h323.cxx:1907: error: 'class AST_G711Capability' has no member named 'SetTxFramesInPacket'
ast_h323.cxx:1911: error: `H323_G711Capability' has not been declared
ast_h323.cxx:1911: error: `ALaw' undeclared (first use this function)
ast_h323.cxx:1913: error: 'class AST_G711Capability' has no member named 'SetTxFramesInPacket'
ast_h323.cxx:1922: error: `H323_UserInputCapability' has not been declared
ast_h323.cxx:1922: error: `H323_UserInputCapability' has not been declared
ast_h323.cxx:1922: error: `HookFlashH245' undeclared (first use this function)
ast_h323.cxx:1927: error: `H323_UserInputCapability' has not been declared
ast_h323.cxx:1927: error: `H323_UserInputCapability' has not been declared
ast_h323.cxx:1927: error: `BasicString' undeclared (first use this function)
ast_h323.cxx:1928: error: `sendUserInputMode' undeclared (first use this function)
ast_h323.cxx:1928: error: `SendUserInputAsString' undeclared (first use this function)
ast_h323.cxx:1930: error: `H323_UserInputCapability' has not been declared
ast_h323.cxx:1930: error: `H323_UserInputCapability' has not been declared
ast_h323.cxx:1930: error: `SignalToneRFC2833' undeclared (first use this function)
ast_h323.cxx:1932: error: `H323_UserInputCapability' has not been declared
ast_h323.cxx:1932: error: `H323_UserInputCapability' has not been declared
ast_h323.cxx:1932: error: `SignalToneH245' undeclared (first use this function)
ast_h323.cxx:1933: error: `SendUserInputAsTone' undeclared (first use this function)
ast_h323.cxx: At global scope:
ast_h323.cxx:1941: error: expected `,' or `...' before '&' token
ast_h323.cxx:1942: error: ISO C++ forbids declaration of `H225_TransportAddress' with no type
ast_h323.cxx: In member function `virtual int MyH323Connection::StartControlChannel(int)':
ast_h323.cxx:1944: error: `h245Address' undeclared (first use this function)
ast_h323.cxx:1944: error: `H225_TransportAddress' is not a class or namespace
ast_h323.cxx:1946: error: `e_ipAddress' undeclared (first use this function)
ast_h323.cxx:1946: error: `H225_TransportAddress' is not a class or namespace
ast_h323.cxx:1948: error: `e_ip6Address' undeclared (first use this function)
ast_h323.cxx:1954: error: `controlChannel' undeclared (first use this function)
ast_h323.cxx:1957: error: `PIPSocket' has not been declared
ast_h323.cxx:1957: error: `Address' undeclared (first use this function)
ast_h323.cxx:1957: error: expected `;' before "addr"
ast_h323.cxx:1959: error: `GetSignallingChannel' undeclared (first use this function)
ast_h323.cxx:1959: error: `addr' undeclared (first use this function)
ast_h323.cxx:1963: error: `endpoint' undeclared (first use this function)
ast_h323.cxx:1965: error: `H323TransportTCP' has not been declared
ast_h323.cxx: At global scope:
ast_h323.cxx:1985: error: expected `,' or `...' before '&' token
ast_h323.cxx:1988: error: ISO C++ forbids declaration of `H323Capability' with no type
ast_h323.cxx: In constructor `MyH323_ExternalRTPChannel::MyH323_ExternalRTPChannel(MyH323Connection&, int)':
ast_h323.cxx:1988: error: `H323_ExternalRTPChannel' has not been declared
ast_h323.cxx:1988: error: class `MyH323_ExternalRTPChannel' does not have any field named `H323_ExternalRTPChannel'
ast_h323.cxx:1988: error: `capability' undeclared (first use this function)
ast_h323.cxx:1988: error: `direction' undeclared (first use this function)
ast_h323.cxx:1988: error: `id' undeclared (first use this function)
ast_h323.cxx:1993: error: 'class MyH323Connection' has no member named 'GetCallReference'
ast_h323.cxx:1993: error: 'class MyH323Connection' has no member named 'GetCallToken'
ast_h323.cxx:1998: error: `localIpAddr' undeclared (first use this function)
ast_h323.cxx:2001: error: `H323TransportAddress' undeclared (first use this function)
ast_h323.cxx:2001: error: `SetExternalAddress' undeclared (first use this function)
ast_h323.cxx:2007: error: `OpalMediaFormat' undeclared (first use this function)
ast_h323.cxx:2007: error: expected `;' before "format"
ast_h323.cxx:2008: error: `format' undeclared (first use this function)
ast_h323.cxx: In member function `int MyH323_ExternalRTPChannel::Start()':
ast_h323.cxx:2021: error: `H323_ExternalRTPChannel' has not been declared
ast_h323.cxx:2027: error: `sessionID' undeclared (first use this function)
ast_h323.cxx:2031: error: `H323_ExternalRTPChannel' has not been declared
ast_h323.cxx:2031: error: `remoteIpAddr' undeclared (first use this function)
ast_h323.cxx:2031: error: `GetRemoteAddress' undeclared (first use this function)
ast_h323.cxx:2036: error: `localIpAddr' undeclared (first use this function)
ast_h323.cxx:2040: error: `connection' undeclared (first use this function)
ast_h323.cxx: At global scope:
ast_h323.cxx:2045: error: expected `,' or `...' before '&' token
ast_h323.cxx:2046: error: ISO C++ forbids declaration of `H245_H2250LogicalChannelAckParameters' with no type
ast_h323.cxx: In member function `int MyH323_ExternalRTPChannel::OnReceivedAckPDU(int)':
ast_h323.cxx:2051: error: `H323_ExternalRTPChannel' has not been declared
ast_h323.cxx:2051: error: `param' undeclared (first use this function)
ast_h323.cxx:2052: error: `remoteIpAddr' undeclared (first use this function)
ast_h323.cxx:2052: error: `GetRemoteAddress' undeclared (first use this function)
ast_h323.cxx:2057: error: `connection' undeclared (first use this function)
ast_h323.cxx: In function `void h323_gk_urq()':
ast_h323.cxx:2096: error: 'class MyH323EndPoint' has no member named 'RemoveGatekeeper'
ast_h323.cxx: In function `int h323_set_capabilities(const char*, int, int, ast_codec_pref*, int)':
ast_h323.cxx:2157: error: 'class MyH323EndPoint' has no member named 'FindConnectionWithLock'
ast_h323.cxx:2163: error: 'class MyH323Connection' has no member named 'Unlock'
ast_h323.cxx: In function `int h323_start_listener(int, sockaddr_in)':
ast_h323.cxx:2177: error: `PIPSocket' has not been declared
ast_h323.cxx:2177: error: `Address' undeclared (first use this function)
ast_h323.cxx:2177: error: expected `;' before "interfaceAddress"
ast_h323.cxx:2182: error: `H323ListenerTCP' undeclared (first use this function)
ast_h323.cxx:2182: error: `tcpListener' undeclared (first use this function)
ast_h323.cxx:2183: error: `H323ListenerTCP' has not been declared
ast_h323.cxx:2183: error: `interfaceAddress' undeclared (first use this function)
ast_h323.cxx:2184: error: 'class MyH323EndPoint' has no member named 'StartListener'
ast_h323.cxx:2185: error: expected primary-expression before ')' token
ast_h323.cxx:2185: error: expected `)' before "tcpListener"
ast_h323.cxx: In function `int h323_set_alias(oh323_alias*)':
ast_h323.cxx:2207: error: 'class MyH323EndPoint' has no member named 'AddAliasName'
ast_h323.cxx:2208: error: 'class MyH323EndPoint' has no member named 'RemoveAliasName'
ast_h323.cxx:2212: error: 'class MyH323EndPoint' has no member named 'AddAliasName'
ast_h323.cxx: In function `void h323_set_id(char*)':
ast_h323.cxx:2235: error: 'class MyH323EndPoint' has no member named 'SetLocalUserName'
ast_h323.cxx: In function `void h323_show_tokens()':
ast_h323.cxx:2240: error: 'class MyH323EndPoint' has no member named 'GetAllConnections'
ast_h323.cxx: In function `int h323_set_gk(int, char*, char*)':
ast_h323.cxx:2250: error: `H323TransportUDP' undeclared (first use this function)
ast_h323.cxx:2250: error: `rasChannel' undeclared (first use this function)
ast_h323.cxx:2262: error: 'class MyH323EndPoint' has no member named 'SetGatekeeperPassword'
ast_h323.cxx:2266: error: 'class MyH323EndPoint' has no member named 'DiscoverGatekeeper'
ast_h323.cxx:2266: error: no matching function for call to `MyH323TransportUDP::MyH323TransportUDP(MyH323EndPoint&)'
compat_h323.h:28: note: candidates are: MyH323TransportUDP::MyH323TransportUDP()
compat_h323.h:28: note: MyH323TransportUDP::MyH323TransportUDP(const MyH323TransportUDP&)
ast_h323.cxx:2267: error: 'class MyH323EndPoint' has no member named 'GetGatekeeper'
ast_h323.cxx:2273: error: no matching function for call to `MyH323TransportUDP::MyH323TransportUDP(MyH323EndPoint&)'
compat_h323.h:28: note: candidates are: MyH323TransportUDP::MyH323TransportUDP()
compat_h323.h:28: note: MyH323TransportUDP::MyH323TransportUDP(const MyH323TransportUDP&)
ast_h323.cxx:2279: error: 'class MyH323EndPoint' has no member named 'SetGatekeeper'
ast_h323.cxx:2280: error: 'class MyH323EndPoint' has no member named 'GetGatekeeper'
ast_h323.cxx: In function `int h323_clear_call(const char*, int)':
ast_h323.cxx:2322: error: `H225_ReleaseCompleteReason' undeclared (first use this function)
ast_h323.cxx:2322: error: expected `;' before "dummy"
ast_h323.cxx:2323: error: `H323Connection' has not been declared
ast_h323.cxx:2323: error: `CallEndReason' undeclared (first use this function)
ast_h323.cxx:2323: error: expected `;' before "r"
ast_h323.cxx:2332: error: `r' undeclared (first use this function)
ast_h323.cxx:2332: error: `Q931' has not been declared
ast_h323.cxx:2332: error: `CauseValues' undeclared (first use this function)
ast_h323.cxx:2332: error: `dummy' undeclared (first use this function)
ast_h323.cxx:2332: error: `H323TranslateToCallEndReason' undeclared (first use this function)
ast_h323.cxx:2335: error: 'class MyH323EndPoint' has no member named 'FindConnectionWithLock'
ast_h323.cxx:2338: error: 'class MyH323Connection' has no member named 'SetCallEndReason'
ast_h323.cxx:2339: error: 'class MyH323Connection' has no member named 'Unlock'
ast_h323.cxx: In function `int h323_send_alerting(const char*)':
ast_h323.cxx:2349: error: `H323Connection' undeclared (first use this function)
ast_h323.cxx:2349: error: `connection' undeclared (first use this function)
ast_h323.cxx:2354: error: 'class MyH323EndPoint' has no member named 'FindConnectionWithLock'
ast_h323.cxx:2359: error: `H323Connection' has not been declared
ast_h323.cxx:2359: error: `AnswerCallPending' undeclared (first use this function)
ast_h323.cxx: In function `int h323_send_progress(const char*)':
ast_h323.cxx:2368: error: `H323Connection' undeclared (first use this function)
ast_h323.cxx:2368: error: `connection' undeclared (first use this function)
ast_h323.cxx:2370: error: 'class MyH323EndPoint' has no member named 'FindConnectionWithLock'
ast_h323.cxx: In function `int h323_answering_call(const char*, int)':
ast_h323.cxx:2389: error: `H323Connection' undeclared (first use this function)
ast_h323.cxx:2389: error: `connection' undeclared (first use this function)
ast_h323.cxx:2391: error: 'class MyH323EndPoint' has no member named 'FindConnectionWithLock'
ast_h323.cxx:2401: error: `H323Connection' has not been declared
ast_h323.cxx:2401: error: `AnswerCallNow' undeclared (first use this function)
ast_h323.cxx:2406: error: `H323Connection' has not been declared
ast_h323.cxx:2406: error: `AnswerCallDenied' undeclared (first use this function)
ast_h323.cxx: In function `void h323_native_bridge(const char*, const char*, char*)':
ast_h323.cxx:2424: error: `H323Channel' undeclared (first use this function)
ast_h323.cxx:2424: error: `channel' undeclared (first use this function)
ast_h323.cxx:2425: error: 'class MyH323EndPoint' has no member named 'FindConnectionWithLock'
ast_h323.cxx:2434: error: 'class MyH323Connection' has no member named 'FindChannel'
ast_h323.cxx:2436: error: 'class MyH323Connection' has no member named 'CloseLogicalChannelNumber'
ast_h323.cxx:2438: error: 'class MyH323Connection' has no member named 'Unlock'
ast_h323.cxx: In function `void h323_end_process()':
ast_h323.cxx:2448: error: 'class MyH323EndPoint' has no member named 'ClearAllCalls'
ast_h323.cxx:2449: error: 'class MyH323EndPoint' has no member named 'RemoveListener'
ast_h323.cxx: At global scope:
ast_h323.cxx:829: warning: 'FetchInformationElements' defined but not used
ast_h323.cxx:887: warning: 'FetchCiscoTunneledInfo' defined but not used
ast_h323.cxx:931: warning: 'EmbedCiscoTunneledInfo' defined but not used
ast_h323.cxx:1001: warning: 'FetchQSIGTunneledInfo' defined but not used
ast_h323.cxx:1051: warning: 'QSIGTunnelRequested' defined but not used
ast_h323.cxx:1070: warning: 'EmbedQSIGTunneledInfo' defined but not used
ast_h323.cxx:1262: warning: 'int BuildFastStartList(int)' defined but not used
make[2]: *** [ast_h323.o] Error 1
make[1]: *** [h323/libchanh323.a] Error 2
make: *** [channels] Error 2
error: Shell command "cd /home/admin/conary/builds/asterisk/asterisk-1.4.0/; CFLAGS="-O2 -march=i686 -g -I/usr/kerberos/include" CXXFLAGS="-O2 -march=i686 -g -I/usr/kerberos/include " CPPFLAGS="" CLASSPATH="" LDFLAGS="-g" CC=gcc CXX=g++ make " exited with exit code 2
/usr/src/asterisk/asterisk/asterisk.recipe:72: RuntimeError: Shell command "cd /home/admin/conary/builds/asterisk/asterisk-1.4.0/; CFLAGS="-O2 -march=i686 -g -I/usr/kerberos/include" CXXFLAGS="-O2 -march=i686 -g -I/usr/kerberos/include " CPPFLAGS="" CLASSPATH="" LDFLAGS="-g" CC=gcc CXX=g++ make " exited with exit code 2