[admin@asterisk asterisk]$ cvc cook asterisk.recipe
+ Building asterisk=asterisk.rpath.org@pk:1-4[~asterisk.gui,~asterisk.h323,~asterisk.jabber,~asterisk.libpri,~asterisk.mISDN,~asterisk.odbc,~asterisk.postgres,~asterisk.zaptel,~builddocs]
+ Cleaning your old build tree
+ found asterisk-1.4.0.tar.gz in repository
+ gzip -d -c < '/home/admin/conary/cache/asterisk/ftp.digium.com/pub/asterisk/asterisk-1.4.0.tar.gz' | tar -C /home/admin/conary/builds/asterisk/ -xSf -
+ attempting to apply /usr/src/asterisk/asterisk/configure.patch with to /home/admin/conary/builds/asterisk/asterisk-1.4.0/ with patch level(s) 1, 0, 2, 3
+ patching file configure
Hunk #1 succeeded at 22797 (offset -1923 lines).
+ applied successfully with patch level 0
+ attempting to apply /usr/src/asterisk/asterisk/chan_h323.c.patch with to /home/admin/conary/builds/asterisk/asterisk-1.4.0/ with patch level(s) 1, 0, 2, 3
+ patching file channels/chan_h323.c
+ applied successfully with patch level 0
+ attempting to apply /usr/src/asterisk/asterisk/makefile.channels.patch with to /home/admin/conary/builds/asterisk/asterisk-1.4.0/ with patch level(s) 1, 0, 2, 3
+ patching file channels/Makefile
Hunk #1 succeeded at 77 with fuzz 1.
+ applied successfully with patch level 0
+ attempting to apply /usr/src/asterisk/asterisk/makefile.patch with to /home/admin/conary/builds/asterisk/asterisk-1.4.0/ with patch level(s) 1, 0, 2, 3
+ patching file Makefile
Hunk #1 succeeded at 229 (offset 41 lines).
+ applied successfully with patch level 0
+ attempting to apply /usr/src/asterisk/asterisk/rc.asterisk.patch with to /home/admin/conary/builds/asterisk/asterisk-1.4.0/ with patch level(s) 1, 0, 2, 3
+ patching file contrib/init.d/rc.redhat.asterisk
+ applied successfully with patch level 0
+ attempting to apply /usr/src/asterisk/asterisk/makefile.sounds.patch with to /home/admin/conary/builds/asterisk/asterisk-1.4.0/ with patch level(s) 1, 0, 2, 3
+ patching file sounds/Makefile
+ applied successfully with patch level 0
+ attempting to apply /usr/src/asterisk/asterisk/manager.conf.gui.patch with to /home/admin/conary/builds/asterisk/asterisk-1.4.0/ with patch level(s) 1, 0, 2, 3
+ patching file configs/manager.conf.sample
Hunk #1 succeeded at 22 with fuzz 2.
+ applied successfully with patch level 0
+ attempting to apply /usr/src/asterisk/asterisk/httpd.conf.gui.patch with to /home/admin/conary/builds/asterisk/asterisk-1.4.0/ with patch level(s) 1, 0, 2, 3
+ patching file configs/http.conf.sample
+ applied successfully with patch level 0
+ attempting to apply /usr/src/asterisk/asterisk/users.conf.gui.patch with to /home/admin/conary/builds/asterisk/asterisk-1.4.0/ with patch level(s) 1, 0, 2, 3
+ patching file configs/users.conf.sample
+ applied successfully with patch level 0
+ attempting to apply /usr/src/asterisk/asterisk/extensions.conf.gui.patch with to /home/admin/conary/builds/asterisk/asterisk-1.4.0/ with patch level(s) 1, 0, 2, 3
+ patching file configs/extensions.conf.sample
+ applied successfully with patch level 0
+ attempting to apply /usr/src/asterisk/asterisk/pbx_config.c.diff with to /home/admin/conary/builds/asterisk/asterisk-1.4.0/ with patch level(s) 1, 0, 2, 3
+ patch level 1 FAILED
+ missing header for unified diff at line 3 of patch
can't find file to patch at input line 3
Perhaps you used the wrong -p or --strip option?
The text leading up to this was:
--------------------------
|--- pbx_config.c (revision 49069)
|+++ pbx_config.c (working copy)
--------------------------
File to patch:
Skip this patch? [y]
Skipping patch.
1 out of 1 hunk ignored
+ patch level 0 FAILED
+ can't find file to patch at input line 3
Perhaps you used the wrong -p or --strip option?
The text leading up to this was:
--------------------------
|--- pbx_config.c (revision 49069)
|+++ pbx_config.c (working copy)
--------------------------
File to patch:
Skip this patch? [y]
Skipping patch.
1 out of 1 hunk ignored
+ patch level 2 FAILED
+ missing header for unified diff at line 3 of patch
can't find file to patch at input line 3
Perhaps you used the wrong -p or --strip option?
The text leading up to this was:
--------------------------
|--- pbx_config.c (revision 49069)
|+++ pbx_config.c (working copy)
--------------------------
File to patch:
Skip this patch? [y]
Skipping patch.
1 out of 1 hunk ignored
+ patch level 3 FAILED
+ missing header for unified diff at line 3 of patch
can't find file to patch at input line 3
Perhaps you used the wrong -p or --strip option?
The text leading up to this was:
--------------------------
|--- pbx_config.c (revision 49069)
|+++ pbx_config.c (working copy)
--------------------------
File to patch:
Skip this patch? [y]
Skipping patch.
1 out of 1 hunk ignored
error: could not apply patch /usr/src/asterisk/asterisk/pbx_config.c.diff in directory /home/admin/conary/builds/asterisk/asterisk-1.4.0/
error: could not apply patch /usr/src/asterisk/asterisk/pbx_config.c.diff