ow type `make' to compile evolution-data-server
*** Building evolution-data-server *** [1/1]
make
make all-recursive
make[1]: Entering directory `/home/abhishek/svn/gnome2/evolution-data-server'
Making all in libdb
make[2]: Entering directory `/home/abhishek/svn/gnome2/evolution-data-server/libdb'
Making all in dist
make[3]: Entering directory `/home/abhishek/svn/gnome2/evolution-data-server/libdb/dist'
/usr/bin/sh ./libtool --mode=link cc -o db_archive \
db_archive.lo util_sig.lo libdb-4.1.la
cc -o db_archive db_archive.o util_sig.o ./.libs/libdb-4.1.al
cc: db_archive.o: No such file or directory
cc: util_sig.o: No such file or directory
make[3]: *** [db_archive] Error 1
make[3]: Leaving directory `/home/abhishek/svn/gnome2/evolution-data-server/libdb/dist'
make[2]: *** [all-recursive] Error 1
make[2]: Leaving directory `/home/abhishek/svn/gnome2/evolution-data-server/libdb'
make[1]: *** [all-recursive] Error 1
make[1]: Leaving directory `/home/abhishek/svn/gnome2/evolution-data-server'
make: *** [all] Error 2
*** error during stage build of evolution-data-server: Error running make *** [1/1]
[1] rerun stage build
[2] ignore error and continue to install
[3] give up on module
[4] start shell
[5] go to stage force_checkout
[6] go to stage configure
choice: 3
*** the following modules were not built *** [1/1]