All pastes #362752 Raw Edit

Miscellany

public text v1 · immutable
·published 2007-02-19 00:55 UTC
rendered paste body
t --define=TypeCode=TTypeCode --deps ./.deps/corba-defs.idl.P ../../../src/orb/orb-core/corba-defs.idl
orbit-idl-2 2.14.2 compiling
  mode, show preprocessor errors, passes: headers 

Processing file ../../../src/orb/orb-core/corba-defs.idl
gcc-config error: Could not run/locate "i386-pc-linux-gnu-gcc"

** (orbit-idl-2:5347): WARNING **: ../../../src/orb/orb-core/corba-defs.idl compilation failed
make[8]: *** [corba-defs.h] Error 1
make[8]: Leaving directory `/var/tmp/portage/gnome-base/orbit-2.14.2/work/ORBit2-2.14.2/include/orbit/orb-core'
make[7]: *** [all-recursive] Error 1
make[7]: Leaving directory `/var/tmp/portage/gnome-base/orbit-2.14.2/work/ORBit2-2.14.2/include/orbit'
make[6]: *** [all] Error 2
make[6]: Leaving directory `/var/tmp/portage/gnome-base/orbit-2.14.2/work/ORBit2-2.14.2/include/orbit'
make[5]: *** [all-recursive] Error 1
make[5]: Leaving directory `/var/tmp/portage/gnome-base/orbit-2.14.2/work/ORBit2-2.14.2/include'
make[4]: *** [all] Error 2
make[4]: Leaving directory `/var/tmp/portage/gnome-base/orbit-2.14.2/work/ORBit2-2.14.2/src/orb/include'
make[3]: *** [all-recursive] Error 1
make[3]: Leaving directory `/var/tmp/portage/gnome-base/orbit-2.14.2/work/ORBit2-2.14.2/src/orb'
make[2]: *** [all-recursive] Error 1
make[2]: Leaving directory `/var/tmp/portage/gnome-base/orbit-2.14.2/work/ORBit2-2.14.2/src'
make[1]: *** [all-recursive] Error 1
make[1]: Leaving directory `/var/tmp/portage/gnome-base/orbit-2.14.2/work/ORBit2-2.14.2'
make: *** [all] Error 2

!!! ERROR: gnome-base/orbit-2.14.2 failed.
Call stack:
  ebuild.sh, line 1614:   Called dyn_compile
  ebuild.sh, line 971:   Called qa_call 'src_compile'
  environment, line 1730:   Called src_compile
  orbit-2.14.2.ebuild, line 43:   Called gnome2_src_compile
  gnome2.eclass, line 71:   Called die