rendered paste bodyCollecting system binaries and libraries... done.
(/root/.revdep-rebuild.1_files)
Collecting complete LD_LIBRARY_PATH... done.
(/root/.revdep-rebuild.2_ldpath)
Checking dynamic linking consistency...
broken /usr/bin/eog (requires libexif.so.10)
broken /usr/bin/gthumb (requires libexif.so.10)
broken /usr/lib/gimp/2.0/plug-ins/jpeg (requires libexif.so.10)
broken /usr/lib/nautilus/extensions-1.0/libevince-properties-page.so (requires libnautilus-extension.so.1)
broken /usr/lib/nautilus/extensions-1.0/libnautilus-burn-extension.so (requires libnautilus-extension.so.1)
broken /usr/lib/nautilus/extensions-1.0/libnautilus-fileroller.so (requires libnautilus-extension.so.1)
broken /usr/lib/nautilus/extensions-1.0/libnautilus-gksu.so (requires libnautilus-extension.so.1)
broken /usr/lib/nautilus/extensions-1.0/libnautilus-themus.so (requires libnautilus-extension.so.1)
broken /usr/lib/nautilus/extensions-1.0/libtotem-properties-page.so (requires libnautilus-extension.so.1)
broken /usr/lib/nautilus/extensions-1.0/libevince-properties-page.la (requires /usr/lib/libnautilus-extension.la)
broken /usr/lib/nautilus/extensions-1.0/libnautilus-burn-extension.la (requires /usr/lib/libnautilus-extension.la)
broken /usr/lib/nautilus/extensions-1.0/libnautilus-fileroller.la (requires /usr/lib/libnautilus-extension.la)
broken /usr/lib/nautilus/extensions-1.0/libnautilus-gksu.la (requires /usr/lib/libnautilus-extension.la)
broken /usr/lib/nautilus/extensions-1.0/libnautilus-themus.la (requires /usr/lib/libnautilus-extension.la)
broken /usr/lib/nautilus/extensions-1.0/libtotem-properties-page.la (requires /usr/lib/libnautilus-extension.la)
done.
(/root/.revdep-rebuild.3_rebuild)
Assigning files to ebuilds... done.
(/root/.revdep-rebuild.4_ebuilds)
----------------------------------------------------------------------------
i686-pc-linux-gnu-ranlib .libs/libbackground.a
creating libbackground.la
(cd .libs && rm -f libbackground.la && ln -s ../libbackground.la libbackground.la)
make[2]: Leaving directory `/var/tmp/portage/gnome-base/nautilus-2.16.3/work/nautilus-2.16.3/libbackground'
Making all in libnautilus-private
make[2]: Entering directory `/var/tmp/portage/gnome-base/nautilus-2.16.3/work/nautilus-2.16.3/libnautilus-private'
/usr/bin/orbit-idl-2 -I.. -I /usr/share/idl/bonobo-activation-2.0 -I /usr/share/idl/bonobo-2.0 nautilus-metafile-server.idl
orbit-idl-2 2.14.2 compiling
mode, hide preprocessor errors, passes: stubs skels common headers
Processing file nautilus-metafile-server.idl
** (orbit-idl-2:2228): WARNING **: nautilus-metafile-server.idl compilation failed
make[2]: *** [nautilus_metafile_server_idl_stamp] Error 1
make[2]: Leaving directory `/var/tmp/portage/gnome-base/nautilus-2.16.3/work/nautilus-2.16.3/libnautilus-private'
make[1]: *** [all-recursive] Error 1
make[1]: Leaving directory `/var/tmp/portage/gnome-base/nautilus-2.16.3/work/nautilus-2.16.3'
make: *** [all] Error 2
!!! ERROR: gnome-base/nautilus-2.16.3 failed.
Call stack:
ebuild.sh, line 1614: Called dyn_compile
ebuild.sh, line 971: Called qa_call 'src_compile'
environment, line 3515: Called src_compile
ebuild.sh, line 1304: Called gnome2_src_compile
gnome2.eclass, line 71: Called die
!!! compile failure
!!! If you need support, post the topmost build error, and the call stack if relevant.
!!! A complete build log is located at '/var/tmp/portage/gnome-base/nautilus-2.16.3/temp/build.log'.