** (orbit-idl-2:21470): WARNING **: nautilus-metafile-server.idl compilation failed
make[2]: *** [nautilus_metafile_server_idl_stamp] Error 1
make[2]: *** Waiting for unfinished jobs....
Merging translations into apps_nautilus_preferences.schemas.
make[2]: Leaving directory `/var/tmp/portage/gnome-base/nautilus-2.16.3/work/nautilus-2.16.3/libnautilus-private'
make[1]: *** [all-recursive] Error 1
make[1]: Leaving directory `/var/tmp/portage/gnome-base/nautilus-2.16.3/work/nautilus-2.16.3'
make: *** [all] Error 2
!!! ERROR: gnome-base/nautilus-2.16.3 failed.
Call stack:
ebuild.sh, line 1614: Called dyn_compile
ebuild.sh, line 971: Called qa_call 'src_compile'
environment, line 3512: Called src_compile
ebuild.sh, line 1304: Called gnome2_src_compile
gnome2.eclass, line 71: Called die
!!! compile failure
!!! If you need support, post the topmost build error, and the call stack if relevant.
!!! A complete build log is located at '/var/tmp/portage/gnome-base/nautilus-2.16.3/temp/build.log'.