All pastes #361102 Raw Edit

Miscellany

public text v1 · immutable
·published 2007-02-17 22:39 UTC
rendered paste body
gcc -O0 -INONE -I../.. -I../nvcontrol   -c -o backend.o backend.c
In file included from ../nvcontrol/nvcontrol.h:26,
                 from backend.c:29:
../nvcontrol/libnvcontrol.h:36:22: error: X11/Xlib.h: Aucun fichier ou répertoire de ce type
../nvcontrol/libnvcontrol.h:37:21: error: X11/Xmd.h: Aucun fichier ou répertoire de ce type
In file included from ../nvcontrol/nvcontrol.h:26,
                 from backend.c:29:
../nvcontrol/libnvcontrol.h:219: error: expected specifier-qualifier-list before ‘CARD8’
../nvcontrol/libnvcontrol.h:306: error: expected specifier-qualifier-list before ‘Display’
../nvcontrol/libnvcontrol.h:321: error: expected ‘)’ before ‘*’ token
../nvcontrol/libnvcontrol.h:322: error: expected ‘)’ before ‘*’ token
../nvcontrol/libnvcontrol.h:323: error: expected ‘)’ before ‘*’ token
../nvcontrol/libnvcontrol.h:324: error: expected ‘)’ before ‘*’ token
../nvcontrol/libnvcontrol.h:325: error: expected ‘)’ before ‘*’ token
../nvcontrol/libnvcontrol.h:326: error: expected ‘)’ before ‘*’ token
../nvcontrol/libnvcontrol.h:327: error: expected ‘)’ before ‘*’ token
make[2]: *** [backend.o] Erreur 1
make[2]: quittant le répertoire « /home/stephane/Desktop/nvclock/src/backend »
make[2]: entrant dans le répertoire « /home/stephane/Desktop/nvclock/src/nvcontrol »
gcc -INONE -I../backend   -c -o libnvcontrol.o libnvcontrol.c
libnvcontrol.c:32:19: error: X11/X.h: Aucun fichier ou répertoire de ce type
libnvcontrol.c:33:22: error: X11/Xlib.h: Aucun fichier ou répertoire de ce type
libnvcontrol.c:34:25: error: X11/Xlibint.h: Aucun fichier ou répertoire de ce type
libnvcontrol.c:35:36: error: X11/extensions/extutil.h: Aucun fichier ou répertoire de ce type
In file included from nvcontrol.h:26,
                 from libnvcontrol.c:39:
libnvcontrol.h:37:21: error: X11/Xmd.h: Aucun fichier ou répertoire de ce type
In file included from nvcontrol.h:26,
                 from libnvcontrol.c:39:
libnvcontrol.h:219: error: expected specifier-qualifier-list before ‘CARD8’
libnvcontrol.h:306: error: expected specifier-qualifier-list before ‘Display’
libnvcontrol.h:321: error: expected ‘)’ before ‘*’ token
libnvcontrol.h:322: error: expected ‘)’ before ‘*’ token
libnvcontrol.h:323: error: expected ‘)’ before ‘*’ token
libnvcontrol.h:324: error: expected ‘)’ before ‘*’ token
libnvcontrol.h:325: error: expected ‘)’ before ‘*’ token
libnvcontrol.h:326: error: expected ‘)’ before ‘*’ token
libnvcontrol.h:327: error: expected ‘)’ before ‘*’ token
libnvcontrol.c:41: error: expected ‘=’, ‘,’, ‘;’, ‘asm’ or ‘__attribute__’ before ‘wire_to_event’
libnvcontrol.c:43: error: expected ‘=’, ‘,’, ‘;’, ‘asm’ or ‘__attribute__’ before ‘Hooks’
libnvcontrol.c:56: error: expected ‘=’, ‘,’, ‘;’, ‘asm’ or ‘__attribute__’ before ‘*’ token
libnvcontrol.c:57: error: expected ‘)’ before string constant
libnvcontrol.c:60: error: expected ‘)’ before ‘*’ token
libnvcontrol.c:81: error: expected ‘)’ before ‘*’ token
libnvcontrol.c:116: error: expected ‘)’ before ‘*’ token
libnvcontrol.c:155: error: expected ‘)’ before ‘*’ token
libnvcontrol.c:196: error: expected ‘)’ before ‘*’ token
libnvcontrol.c:258: error: expected ‘)’ before ‘*’ token
libnvcontrol.c:286: error: expected ‘)’ before ‘*’ token
libnvcontrol.c:312: error: expected ‘=’, ‘,’, ‘;’, ‘asm’ or ‘__attribute__’ before ‘wire_to_event’
make[2]: *** [libnvcontrol.o] Erreur 1
make[2]: quittant le répertoire « /home/stephane/Desktop/nvclock/src/nvcontrol »
make[2]: entrant dans le répertoire « /home/stephane/Desktop/nvclock/src/gtk »
make[2]: Rien à faire pour « all ».
make[2]: quittant le répertoire « /home/stephane/Desktop/nvclock/src/gtk »
make[2]: entrant dans le répertoire « /home/stephane/Desktop/nvclock/src/qt »
make[2]: Rien à faire pour « all ».
make[2]: quittant le répertoire « /home/stephane/Desktop/nvclock/src/qt »
make[1]: *** Pas de règle pour fabriquer la cible « backend/libbackend.a », nécessaire pour « nvclock ». Arrêt.
make[1]: quittant le répertoire « /home/stephane/Desktop/nvclock/src »
make: *** [all] Erreur 2