All pastes #36089 Raw Edit

Someone

public text v1 · immutable
#36089 ·published 2006-01-07 09:32 UTC
rendered paste body
e2k-action.c:29:27: error: e2k-propnames.h: No such file or directory
e2k-action.c: In function 'addr_entry_set_core':
e2k-action.c:297: error: 'PR_ENTRYID' undeclared (first use in this function)
e2k-action.c:297: error: (Each undeclared identifier is reported only once
e2k-action.c:297: error: for each function it appears in.)
e2k-action.c:301: error: 'PR_DISPLAY_NAME' undeclared (first use in this function)
e2k-action.c:305: error: 'PR_OBJECT_TYPE' undeclared (first use in this function)
e2k-action.c:309: error: 'PR_DISPLAY_TYPE' undeclared (first use in this function)
e2k-action.c:313: error: 'PR_TRANSMITTABLE_DISPLAY_NAME' undeclared (first use in this function)
e2k-action.c:317: error: 'PR_EMAIL_ADDRESS' undeclared (first use in this function)
e2k-action.c:321: error: 'PR_ADDRTYPE' undeclared (first use in this function)
e2k-action.c:325: error: 'PR_SEND_INTERNET_ENCODING' undeclared (first use in this function)
e2k-action.c:329: error: 'PR_RECIPIENT_TYPE' undeclared (first use in this function)
e2k-action.c:333: error: 'PR_SEARCH_KEY' undeclared (first use in this function)
e2k-action.c: In function 'e2k_addr_list_set_local':
e2k-action.c:363: error: 'PR_EMS_AB_DISPLAY_NAME_PRINTABLE' undeclared (first use in this function)
e2k-action.c:367: error: 'PR_SMTP_ADDRESS' undeclared (first use in this function)
e2k-action.c: In function 'e2k_addr_list_set_oneoff':
e2k-action.c:394: error: 'PR_SEND_RICH_INFO' undeclared (first use in this function)
e2k-action.c:398: error: 'PR_RECORD_KEY' undeclared (first use in this function)
e2k-action.c: In function 'extract_action':
e2k-action.c:583: warning: pointer targets in passing argument 3 of 'e2k_rule_extract_uint32' differ in signedness
e2k-action.c: In function 'append_action':
e2k-action.c:712: warning: pointer targets in passing argument 2 of 'g_byte_array_append' differ in signedness
e2k-action.c:718: warning: pointer targets in passing argument 2 of 'g_byte_array_append' differ in signedness
make[3]: *** [e2k-action.lo] Error 1
make[3]: Leaving directory `/home/victor/cvs/gnome2/evolution-data-server/servers/exchange/lib'
make[2]: *** [install-recursive] Error 1
make[2]: Leaving directory `/home/victor/cvs/gnome2/evolution-data-server/servers/exchange'
make[1]: *** [install-recursive] Error 1
make[1]: Leaving directory `/home/victor/cvs/gnome2/evolution-data-server/servers'
make: *** [install-recursive] Error 1