rendered paste bodyPrograms/Qt/Current/bin/moc ./progressdialog.h -o progressdialog.moc
if g++ -DHAVE_CONFIG_H -I. -I. -I.. -I/Programs/KDE-Libs/3.5.3/include -I/Programs/Qt/Current/include -I. -DQT_THREAD_SUPPORT -D_REENTRANT -D_FILE_OFFSET_BITS=64 -Wno-long-long -Wundef -ansi -D_XOPEN_SOURCE=500 -D_BSD_SOURCE -Wcast-align -Wconversion -Wchar-subscripts -Wall -W -Wpointer-arith -DNDEBUG -DNO_DEBUG -O2 -O2 -march=i686 -fomit-frame-pointer -pipe -Wformat-security -Wmissing-format-attribute -Wno-non-virtual-dtor -fno-exceptions -fno-check-new -fno-common -DQT_CLEAN_NAMESPACE -DQT_NO_ASCII_CAST -DQT_NO_STL -DQT_NO_COMPAT -DQT_NO_TRANSLATION -D_GNU_SOURCE -DQT_NO_CAST_ASCII -DQT_NO_ASCII_CAST -MT progressdialog.o -MD -MP -MF ".deps/progressdialog.Tpo" -c -o progressdialog.o progressdialog.cpp; \
then mv -f ".deps/progressdialog.Tpo" ".deps/progressdialog.Po"; else rm -f ".deps/progressdialog.Tpo"; exit 1; fi
progressdialog.cpp: In member function `virtual void ProgressDialog::ignoreCancel()':
progressdialog.cpp:90: error: `ignoreCancel' is not a member of `KProgressDialog'
make[2]: *** [progressdialog.o] Error 1
make[2]: Leaving directory `/Files/Compile/Sources/kdebase-3.5.5/kdialog'
make[1]: *** [all-recursive] Error 1
make[1]: Leaving directory `/Files/Compile/Sources/kdebase-3.5.5'
make: *** [all] Error 2
Compile: Build process failed.
root@NewMachine /Users/glasyalabolis]