All pastes #3577 Raw Edit

glibcfail

public text v1 · immutable
#3577 ·published 2004-12-30 10:22 UTC
rendered paste body
| a - login/getutmp.os
| a - elf/dl-open.os
| a - elf/dl-close.os
| a - elf/dl-iteratephdr.os
| a - elf/dl-addr.os
| a - elf/dl-profstub.os
| a - elf/dl-libc.os
| a - elf/dl-sym.os
| a - elf/dl-tsd.os
| a - elf/unwind-dw2-fde-glibc.os
| a - elf/framestate.os
| a - elf/unwind-pe.os
| : /home/chris/Projects/openembedded/build/tmp/work/glibc-2.3.2+cvs20040726-r13/build-i586-oe-linux/libc_pic.a
| i586-oe-linux-gcc -march=c3 -mtune=c3   -nostdlib -nostartfiles -r -o /home/chris/Projects/openembedded/build/tmp/work/glibc-2.3.2+cvs20040726-r13/build-i586-oe-linux/elf/librtld.map.o '-Wl,-(' /home/chris/Projects/openembedded/build/tmp/work/glibc-2.3.2+cvs20040726-r13/build-i586-oe-linux/elf/dl-allobjs.os /home/chris/Projects/openembedded/build/tmp/work/glibc-2.3.2+cvs20040726-r13/build-i586-oe-linux/libc_pic.a -lgcc '-Wl,-)' -Wl,-Map,/home/chris/Projects/openembedded/build/tmp/work/glibc-2.3.2+cvs20040726-r13/build-i586-oe-linux/elf/librtld.mapT
| /home/chris/Projects/openembedded/build/tmp/cross/lib/gcc/i586-oe-linux/3.4.3/../../../../i586-oe-linux/bin/ld: errno: TLS definition in /home/chris/Projects/openembedded/build/tmp/work/glibc-2.3.2+cvs20040726-r13/build-i586-oe-linux/libc_pic.a(errno.os) section .tbss mismatches non-TLS reference in /home/chris/Projects/openembedded/build/tmp/work/glibc-2.3.2+cvs20040726-r13/build-i586-oe-linux/elf/dl-allobjs.os
| /home/chris/Projects/openembedded/build/tmp/work/glibc-2.3.2+cvs20040726-r13/build-i586-oe-linux/libc_pic.a: could not read symbols: Bad value
| collect2: ld returned 1 exit status
| make[2]: *** [/home/chris/Projects/openembedded/build/tmp/work/glibc-2.3.2+cvs20040726-r13/build-i586-oe-linux/elf/librtld.map] Fehler 1
| make[2]: Leaving directory `/home/chris/Projects/openembedded/build/tmp/work/glibc-2.3.2+cvs20040726-r13/libc/elf'
| make[1]: *** [elf/subdir_lib] Fehler 2
| make[1]: Leaving directory `/home/chris/Projects/openembedded/build/tmp/work/glibc-2.3.2+cvs20040726-r13/libc'
| make: *** [all] Fehler 2
| FATAL: oe_runmake failed
NOTE: Task failed:
ERROR: package glibc-2.3.2+cvs20040726-r13: task do_compile failed
ERROR: TaskFailed event exception, aborting
ERROR: package glibc: build failed
ERROR: Build of bootstrap-image failed
chris@linux:~/Projects/openembedded/build> cd ..