All pastes #357400 Raw Edit

Mine

public text v1 · immutable
·published 2007-02-15 17:39 UTC
rendered paste body
localhost / # emerge gajim
Calculating dependencies... done!
>>> Emerging (1 of 1) net-im/gajim-0.10.1 to /
>>> checking ebuild checksums ;-)
>>> checking auxfile checksums ;-)
>>> checking miscfile checksums ;-)
>>> checking gajim-0.10.1.tar.bz2 ;-)
>>> Unpacking source...
>>> Unpacking gajim-0.10.1.tar.bz2 to /var/tmp/portage/gajim-0.10.1/work
 * Applying gajim-10.1-Makefile.patch ...                                                                              [ ok ] * Applying gajim-10.1-FLAGS_noOverride.patch ...                                                                      [ ok ]>>> Source unpacked.
>>> Compiling source in /var/tmp/portage/gajim-0.10.1/work/gajim-0.10.1 ...
make -C src/common all;
make[1]: Entering directory `/var/tmp/portage/gajim-0.10.1/work/gajim-0.10.1/src/common'
cc  -march=athlon64 -O2 -pipe -msse3  `pkg-config --cflags gtk+-2.0 pygtk-2.0` -fpic -I/usr/include/python`python -c 'import sys; print sys.version[:3]'` -I. `pkg-config --libs gtk+-2.0 pygtk-2.0` -L/usr/X11R6/lib -lX11 -lXss -lXext -lpython`python -c 'import sys; print sys.version[:3]'` -shared idle.c  -o idle.so
idle.c:28:39: error: X11/extensions/scrnsaver.h: No existe el fichero o el directorio
idle.c: En la funci��n ���idle_getIdleSec���:
idle.c:63: error: expected ���=���, ���,���, ���;���, ���asm��� or ���__attribute__��� before ���*��� token
idle.c:63: error: ���mit_info��� no se declar�� aqu�� (primer uso en esta funci��n)
idle.c:63: error: (Cada identificador no declarado solamente se reporta una vez
idle.c:63: error: ara cada funcion en la que aparece.)
idle.c:70: error: ���event_base��� no se declar�� aqu�� (primer uso en esta funci��n)
idle.c:70: error: ���error_base��� no se declar�� aqu�� (primer uso en esta funci��n)
idle.c:75: error: ���idle_time��� no se declar�� aqu�� (primer uso en esta funci��n)
make[1]: *** [idle.so] Error 1
make[1]: Leaving directory `/var/tmp/portage/gajim-0.10.1/work/gajim-0.10.1/src/common'
make: *** [idle] Error 2

!!! ERROR: net-im/gajim-0.10.1 failed.
Call stack:
  ebuild.sh, line 1539:   Called dyn_compile
  ebuild.sh, line 939:   Called src_compile
  gajim-0.10.1.ebuild, line 62:   Called die

!!! Xemake failed
!!! If you need support, post the topmost build error, and the call stack if relevant.

localhost / #