All pastes #357367 Raw Edit

Plouj

public text v1 · immutable
·published 2007-02-15 17:11 UTC
rendered paste body
$ make
cd .. && /bin/sh /home/plouj/www/seom-auto/build-aux/missing --run autoheader
rm -f stamp-h1
touch ../config.h.in
cd . && /bin/sh ./config.status config.h
config.status: creating config.h
config.status: config.h is unchanged
make  all-recursive
make[1]: Entering directory `/www/localhost/htdocs/seom-auto/build'
Making all in include
make[2]: Entering directory `/www/localhost/htdocs/seom-auto/build/include'
Making all in seom
make[3]: Entering directory `/www/localhost/htdocs/seom-auto/build/include/seom'
make[3]: Nothing to be done for `all'.
make[3]: Leaving directory `/www/localhost/htdocs/seom-auto/build/include/seom'
make[3]: Entering directory `/www/localhost/htdocs/seom-auto/build/include'
make[3]: Nothing to be done for `all-am'.
make[3]: Leaving directory `/www/localhost/htdocs/seom-auto/build/include'
make[2]: Leaving directory `/www/localhost/htdocs/seom-auto/build/include'
Making all in lib
make[2]: Entering directory `/www/localhost/htdocs/seom-auto/build/lib'
/bin/sh ../libtool --tag=CC   --mode=compile gcc -DHAVE_CONFIG_H -I. -I.. -I../../lib     -g -O2 -MT buffer.lo -MD -MP -MF .deps/buffer.Tpo -c -o buffer.lo ../../lib/buffer.c
 gcc -DHAVE_CONFIG_H -I. -I.. -I../../lib -g -O2 -MT buffer.lo -MD -MP -MF .deps/buffer.Tpo -c ../../lib/buffer.c  -fPIC -DPIC -o .libs/buffer.o
../../lib/buffer.c:2:23: error: seom/seom.h: No such file or directory
../../lib/buffer.c:4: error: expected '=', ',', ';', 'asm' or '__attribute__' before '*' token
../../lib/buffer.c:29: error: expected ')' before '*' token
../../lib/buffer.c:37: error: expected ')' before '*' token
../../lib/buffer.c:55: error: expected ')' before '*' token
../../lib/buffer.c:67: error: expected ')' before '*' token
../../lib/buffer.c:84: error: expected ')' before '*' token
../../lib/buffer.c:100: error: expected '=', ',', ';', 'asm' or '__attribute__' before 'seomBufferStatus'
make[2]: *** [buffer.lo] Error 1
make[2]: Leaving directory `/www/localhost/htdocs/seom-auto/build/lib'
make[1]: *** [all-recursive] Error 1
make[1]: Leaving directory `/www/localhost/htdocs/seom-auto/build'
make: *** [all] Error 2