All pastes #354456 Raw Edit

Anonymous

public text v1 · immutable
·published 2007-02-13 23:50 UTC
rendered paste body
run-iconv-test.sh: line 61: 25845 Segmentation fault      $PROG -f $from -t $t testdata/$from >$temp1
make[2]: *** [/var/tmp/paludis/sys-libs/glibc-2.5/work/build-x86-x86_64-pc-linux-gnu-nptl/iconvdata/iconv-test.out] Error 1
make[2]: Leaving directory `/var/tmp/paludis/sys-libs/glibc-2.5/work/glibc-2.5/iconvdata'
make[1]: *** [iconvdata/tests] Error 2
make[1]: Leaving directory `/var/tmp/paludis/sys-libs/glibc-2.5/work/glibc-2.5'
make: *** [check] Error 2

!!! ERROR in sys-libs/glibc-2.5:
!!! In toolchain-glibc_src_test at line 272
!!! make check failed for x86-x86_64-pc-linux-gnu-nptl

!!! Call stack:
!!!    * toolchain-glibc_src_test (/usr/portage/sys-libs/glibc/glibc-2.5.ebuild:272)
!!!    * src_test (/usr/portage/sys-libs/glibc/glibc-2.5.ebuild:1142)
!!!    * src_test (/usr/portage/sys-libs/glibc/glibc-2.5.ebuild:1134)
!!!    * ebuild_f_test (/usr/libexec/paludis/src_test.bash:69)
!!!    * ebuild_main (/usr/libexec/paludis/ebuild.bash:339)
!!!    * main (/usr/libexec/paludis/ebuild.bash:351)


!!! This package failed inside the test phase. You should read
!!!    http://paludis.pioto.org/faq.html
!!! for more information on packages with test phase failures.


die trap: exiting with error.

Install error:
  * In program paludis -i udev poppler kate lcms rubygems thunar qemu ktorrent unrar swig rar bind-tools libsndfile sun-jdk wxpython:
  * When performing install action from command line:
  * When executing install task:
  * Install error: Install failed for 'sys-libs/glibc-2.5::gentoo'