All pastes #353073 Raw Edit

seetu

public text v1 · immutable
·published 2007-02-13 04:45 UTC
rendered paste body
scrollkeeper-update -p /var/lib/scrollkeeper -o /home/sheethal_ntn/opt/gnome2/share/omf/evolution
/bin/sh: line 3: 26879 Segmentation fault      scrollkeeper-update -p "`scrollkeeper-config --pkglocalstatedir`" -o "/home/sheethal_ntn/opt/gnome2/share/omf/evolution"
make[3]: *** [install-doc-omf] Error 139
make[3]: Leaving directory `/home/sheethal_ntn/cvs/gnome2/evolution/help'
make[2]: *** [install-am] Error 2
make[2]: Leaving directory `/home/sheethal_ntn/cvs/gnome2/evolution/help'
make[1]: *** [install-recursive] Error 1
make[1]: Leaving directory `/home/sheethal_ntn/cvs/gnome2/evolution/help'
make: *** [install-recursive] Error 1
*** error during stage install of evolution: Error running make   install *** [1/1]


  [1] rerun stage install
  [2] ignore error and continue to done
  [3] give up on module
  [4] start shell