All pastes #35283 Raw Edit

Unnamed

public text v1 · immutable
#35283 ·published 2005-12-30 16:29 UTC
rendered paste body
BMPx Build Configuration
========================

    bmpx Version..........: 0.13
    hrel Version..........: 0.1
    libchroma Version.....: 0.1

    Enable GUI............: yes
    X Session Management..: yes
    Startup Notification..: yes

    XCS Backend...........: XML file

    Audio Backend.........: XINE

    DBus Interface........: yes

    Perl Clients..........: yes
    Python Clients........: yes
    Irssi Plugins.........: yes
    XChat Plugins.........: yes

/bin/sh ./scripts/mkrevision.sh
/bin/sh ./scripts/mkbuild.sh
make  all-recursive
make[1]: Entering directory `/home/stavrosg/devel/build/bmpx-debug/src/bmpx-build'
Making all in libchroma
make[2]: Entering directory `/home/stavrosg/devel/build/bmpx-debug/src/bmpx-build/libchroma'
Making all in libchroma
make[3]: Entering directory `/home/stavrosg/devel/build/bmpx-debug/src/bmpx-build/libchroma/libchroma'
Makefile:281: .deps/libchroma-marshalers.Plo: Δεν υπάρχει τέτοιο αρχείο ή κατάλογος
make[3]: *** No rule to make target `.deps/libchroma-marshalers.Plo'.  Stop.
make[3]: Leaving directory `/home/stavrosg/devel/build/bmpx-debug/src/bmpx-build/libchroma/libchroma'
make[2]: *** [all-recursive] Error 1
make[2]: Leaving directory `/home/stavrosg/devel/build/bmpx-debug/src/bmpx-build/libchroma'
make[1]: *** [all-recursive] Error 1
make[1]: Leaving directory `/home/stavrosg/devel/build/bmpx-debug/src/bmpx-build'
make: *** [all] Error 2