timo@idnet:~/SVN14/subversion-1.4.3$ make swig-pl
if test "/home/timo/SVN14/subversion-1.4.3/subversion/bindings/swig/perl" != "/home/timo/SVN14/subversion-1.4.3/subversion/bindings/swig/perl"; then \
ln -sf /home/timo/SVN14/subversion-1.4.3/subversion/bindings/swig/perl/native/*.c /home/timo/SVN14/subversion-1.4.3/subversion/bindings/swig/perl/native; \
fi
cd /home/timo/SVN14/subversion-1.4.3/subversion/bindings/swig/perl/native; make
make[1]: Entering directory `/home/timo/SVN14/subversion-1.4.3/subversion/bindings/swig/perl/native'
gcc -c -I/usr/local/SVN14/include/apr-1 -I/usr/local/SVN14/include/apr-1 -I../../../../../subversion/bindings/swig/perl/libsvn_swig_perl -I../../../../../subversion/include -I../../../../..//subversion -I../../../../../subversion/bindings/swig -g -fno-strict-aliasing -pipe -I/usr/local/include -D_LARGEFILE_SOURCE -D_FILE_OFFSET_BITS=64 -O2 -DVERSION=\"\" -DXS_VERSION=\"\" -fpic "-I/usr/local/lib/perl5/5.8.8/i686-linux/CORE" core.c
In file included from /usr/local/SVN14/include/apr-1/apr_pools.h:37,
from ../../../../../subversion/include/svn_time.h:25,
from core.c:1107:
/usr/local/SVN14/include/apr-1/apr.h:270: error: syntax error before "apr_off_t"
/usr/local/SVN14/include/apr-1/apr.h:270: warning: data definition has no type or storage class
In file included from ../../../../../subversion/include/svn_string.h:71,
from ../../../../../subversion/include/svn_props.h:30,
from ../../../../../subversion/include/svn_error_codes.h:48,
from ../../../../../subversion/include/svn_error.h:48,
from ../../../../../subversion/include/svn_time.h:28,
from core.c:1107:
/usr/local/SVN14/include/apr-1/apr_strings.h:299: error: syntax error before "apr_off_t"
/usr/local/SVN14/include/apr-1/apr_strings.h:315: error: syntax error before '*' token
/usr/local/SVN14/include/apr-1/apr_strings.h:351: error: syntax error before "size"
In file included from /usr/local/SVN14/include/apr-1/apr_file_io.h:29,
from ../../../../../subversion/include/svn_diff.h:48,
from core.c:1115:
/usr/local/SVN14/include/apr-1/apr_file_info.h:204: error: syntax error before "apr_off_t"
/usr/local/SVN14/include/apr-1/apr_file_info.h:204: warning: no semicolon at end of struct or union
/usr/local/SVN14/include/apr-1/apr_file_info.h:206: warning: data definition has no type or storage class
/usr/local/SVN14/include/apr-1/apr_file_info.h:212: error: `ctime' redeclared as different kind of symbol
/usr/include/time.h:254: error: previous declaration of `ctime'
/usr/local/SVN14/include/apr-1/apr_file_info.h:219: error: syntax error before '}' token
In file included from ../../../../../subversion/include/svn_diff.h:48,
from core.c:1115:
/usr/local/SVN14/include/apr-1/apr_file_io.h:551: error: syntax error before "apr_off_t"
/usr/local/SVN14/include/apr-1/apr_file_io.h:746: error: syntax error before "apr_off_t"
In file included from ../../../../../subversion/include/svn_diff.h:52,
from core.c:1115:
../../../../../subversion/include/svn_io.h:1020: error: syntax error before "apr_off_t"
In file included from core.c:1115:
../../../../../subversion/include/svn_diff.h:221: error: syntax error before "apr_off_t"
../../../../../subversion/include/svn_diff.h:240: error: syntax error before "apr_off_t"
../../../../../subversion/include/svn_diff.h:254: error: syntax error before "apr_off_t"
../../../../../subversion/include/svn_diff.h:266: error: syntax error before "apr_off_t"
../../../../../subversion/include/svn_diff.h:283: error: syntax error before "apr_off_t"
In file included from ../../../../../subversion/include/svn_wc.h:46,
from ../../../../../subversion/include/svn_client.h:38,
from ../../../../../subversion/bindings/swig/perl/libsvn_swig_perl/swigutil_pl.h:36,
from core.c:1122:
../../../../../subversion/include/svn_ra.h:181: error: syntax error before "progress"
In file included from ../../../../../subversion/bindings/swig/perl/libsvn_swig_perl/swigutil_pl.h:38,
from core.c:1122:
../../../../../subversion/svn_private_config.h:153:1: warning: "_" redefined
In file included from /usr/local/lib/perl5/5.8.8/i686-linux/CORE/perl.h:37,
from core.c:517:
/usr/local/lib/perl5/5.8.8/i686-linux/CORE/config.h:3808:1: warning: this is the location of the previous definition
core.c:1281: error: syntax error before "apr_off_t"
core.c: In function `svn_diff_output_fns_invoke_output_common':
core.c:1282: error: `_obj' undeclared (first use in this function)
core.c:1282: error: (Each undeclared identifier is reported only once
core.c:1282: error: for each function it appears in.)
core.c:1282: error: `output_baton' undeclared (first use in this function)
core.c:1282: error: `original_start' undeclared (first use in this function)
core.c:1282: error: `original_length' undeclared (first use in this function)
core.c:1282: error: `modified_start' undeclared (first use in this function)
core.c:1282: error: `modified_length' undeclared (first use in this function)
core.c:1282: error: `latest_start' undeclared (first use in this function)
core.c:1282: error: `latest_length' undeclared (first use in this function)
core.c: At top level:
core.c:1286: error: syntax error before "apr_off_t"
core.c: In function `svn_diff_output_fns_invoke_output_diff_modified':
core.c:1287: error: `_obj' undeclared (first use in this function)
core.c:1287: error: `output_baton' undeclared (first use in this function)
core.c:1287: error: `original_start' undeclared (first use in this function)
core.c:1287: error: `original_length' undeclared (first use in this function)
core.c:1287: error: `modified_start' undeclared (first use in this function)
core.c:1287: error: `modified_length' undeclared (first use in this function)
core.c:1287: error: `latest_start' undeclared (first use in this function)
core.c:1287: error: `latest_length' undeclared (first use in this function)
core.c: At top level:
core.c:1291: error: syntax error before "apr_off_t"
core.c: In function `svn_diff_output_fns_invoke_output_diff_latest':
core.c:1292: error: `_obj' undeclared (first use in this function)
core.c:1292: error: `output_baton' undeclared (first use in this function)
core.c:1292: error: `original_start' undeclared (first use in this function)
core.c:1292: error: `original_length' undeclared (first use in this function)
core.c:1292: error: `modified_start' undeclared (first use in this function)
core.c:1292: error: `modified_length' undeclared (first use in this function)
core.c:1292: error: `latest_start' undeclared (first use in this function)
core.c:1292: error: `latest_length' undeclared (first use in this function)
core.c: At top level:
core.c:1296: error: syntax error before "apr_off_t"
core.c: In function `svn_diff_output_fns_invoke_output_diff_common':
core.c:1297: error: `_obj' undeclared (first use in this function)
core.c:1297: error: `output_baton' undeclared (first use in this function)
core.c:1297: error: `original_start' undeclared (first use in this function)
core.c:1297: error: `original_length' undeclared (first use in this function)
core.c:1297: error: `modified_start' undeclared (first use in this function)
core.c:1297: error: `modified_length' undeclared (first use in this function)
core.c:1297: error: `latest_start' undeclared (first use in this function)
core.c:1297: error: `latest_length' undeclared (first use in this function)
core.c: At top level:
core.c:1301: error: syntax error before "apr_off_t"
core.c: In function `svn_diff_output_fns_invoke_output_conflict':
core.c:1302: error: `_obj' undeclared (first use in this function)
core.c:1302: error: `output_baton' undeclared (first use in this function)
core.c:1302: error: `original_start' undeclared (first use in this function)
core.c:1302: error: `original_length' undeclared (first use in this function)
core.c:1302: error: `modified_start' undeclared (first use in this function)
core.c:1302: error: `modified_length' undeclared (first use in this function)
core.c:1302: error: `latest_start' undeclared (first use in this function)
core.c:1302: error: `latest_length' undeclared (first use in this function)
core.c:1302: error: `resolved_diff' undeclared (first use in this function)
core.c: In function `_wrap_svn_diff_output_fns_t_output_common_set':
core.c:14539: error: syntax error before "apr_off_t"
core.c:14539: error: syntax error before "apr_off_t"
core.c: In function `_wrap_svn_diff_output_fns_t_output_common_get':
core.c:14570: error: syntax error before "apr_off_t"
core.c:14582: error: syntax error before "apr_off_t"
core.c: In function `_wrap_svn_diff_output_fns_t_output_diff_modified_set':
core.c:14597: error: syntax error before "apr_off_t"
core.c:14597: error: syntax error before "apr_off_t"
core.c: In function `_wrap_svn_diff_output_fns_t_output_diff_modified_get':
core.c:14628: error: syntax error before "apr_off_t"
core.c:14640: error: syntax error before "apr_off_t"
core.c: In function `_wrap_svn_diff_output_fns_t_output_diff_latest_set':
core.c:14655: error: syntax error before "apr_off_t"
core.c:14655: error: syntax error before "apr_off_t"
core.c: In function `_wrap_svn_diff_output_fns_t_output_diff_latest_get':
core.c:14686: error: syntax error before "apr_off_t"
core.c:14698: error: syntax error before "apr_off_t"
core.c: In function `_wrap_svn_diff_output_fns_t_output_diff_common_set':
core.c:14713: error: syntax error before "apr_off_t"
core.c:14713: error: syntax error before "apr_off_t"
core.c: In function `_wrap_svn_diff_output_fns_t_output_diff_common_get':
core.c:14744: error: syntax error before "apr_off_t"
core.c:14756: error: syntax error before "apr_off_t"
core.c: In function `_wrap_svn_diff_output_fns_t_output_conflict_set':
core.c:14771: error: syntax error before "apr_off_t"
core.c:14771: error: syntax error before "apr_off_t"
core.c: In function `_wrap_svn_diff_output_fns_t_output_conflict_get':
core.c:14802: error: syntax error before "apr_off_t"
core.c:14814: error: syntax error before "apr_off_t"
core.c: In function `_wrap_svn_diff_fns_invoke_datasource_get_next_token':
core.c:15970: warning: assignment from incompatible pointer type
core.c: In function `_wrap_svn_diff_output_fns_invoke_output_common':
core.c:16105: error: syntax error before "arg3"
core.c:16128: error: `arg3' undeclared (first use in this function)
core.c:16128: error: syntax error before "strtoll"
core.c:16129: error: `arg4' undeclared (first use in this function)
core.c:16129: error: syntax error before "strtoll"
core.c:16130: error: `arg5' undeclared (first use in this function)
core.c:16130: error: syntax error before "strtoll"
core.c:16131: error: `arg6' undeclared (first use in this function)
core.c:16131: error: syntax error before "strtoll"
core.c:16132: error: `arg7' undeclared (first use in this function)
core.c:16132: error: syntax error before "strtoll"
core.c:16133: error: `arg8' undeclared (first use in this function)
core.c:16133: error: syntax error before "strtoll"
core.c: In function `_wrap_svn_diff_output_fns_invoke_output_diff_modified':
core.c:16170: error: syntax error before "arg3"
core.c:16193: error: `arg3' undeclared (first use in this function)
core.c:16193: error: syntax error before "strtoll"
core.c:16194: error: `arg4' undeclared (first use in this function)
core.c:16194: error: syntax error before "strtoll"
core.c:16195: error: `arg5' undeclared (first use in this function)
core.c:16195: error: syntax error before "strtoll"
core.c:16196: error: `arg6' undeclared (first use in this function)
core.c:16196: error: syntax error before "strtoll"
core.c:16197: error: `arg7' undeclared (first use in this function)
core.c:16197: error: syntax error before "strtoll"
core.c:16198: error: `arg8' undeclared (first use in this function)
core.c:16198: error: syntax error before "strtoll"
core.c: In function `_wrap_svn_diff_output_fns_invoke_output_diff_latest':
core.c:16235: error: syntax error before "arg3"
core.c:16258: error: `arg3' undeclared (first use in this function)
core.c:16258: error: syntax error before "strtoll"
core.c:16259: error: `arg4' undeclared (first use in this function)
core.c:16259: error: syntax error before "strtoll"
core.c:16260: error: `arg5' undeclared (first use in this function)
core.c:16260: error: syntax error before "strtoll"
core.c:16261: error: `arg6' undeclared (first use in this function)
core.c:16261: error: syntax error before "strtoll"
core.c:16262: error: `arg7' undeclared (first use in this function)
core.c:16262: error: syntax error before "strtoll"
core.c:16263: error: `arg8' undeclared (first use in this function)
core.c:16263: error: syntax error before "strtoll"
core.c: In function `_wrap_svn_diff_output_fns_invoke_output_diff_common':
core.c:16300: error: syntax error before "arg3"
core.c:16323: error: `arg3' undeclared (first use in this function)
core.c:16323: error: syntax error before "strtoll"
core.c:16324: error: `arg4' undeclared (first use in this function)
core.c:16324: error: syntax error before "strtoll"
core.c:16325: error: `arg5' undeclared (first use in this function)
core.c:16325: error: syntax error before "strtoll"
core.c:16326: error: `arg6' undeclared (first use in this function)
core.c:16326: error: syntax error before "strtoll"
core.c:16327: error: `arg7' undeclared (first use in this function)
core.c:16327: error: syntax error before "strtoll"
core.c:16328: error: `arg8' undeclared (first use in this function)
core.c:16328: error: syntax error before "strtoll"
core.c: In function `_wrap_svn_diff_output_fns_invoke_output_conflict':
core.c:16365: error: syntax error before "arg3"
core.c:16389: error: `arg3' undeclared (first use in this function)
core.c:16389: error: syntax error before "strtoll"
core.c:16390: error: `arg4' undeclared (first use in this function)
core.c:16390: error: syntax error before "strtoll"
core.c:16391: error: `arg5' undeclared (first use in this function)
core.c:16391: error: syntax error before "strtoll"
core.c:16392: error: `arg6' undeclared (first use in this function)
core.c:16392: error: syntax error before "strtoll"
core.c:16393: error: `arg7' undeclared (first use in this function)
core.c:16393: error: syntax error before "strtoll"
core.c:16394: error: `arg8' undeclared (first use in this function)
core.c:16394: error: syntax error before "strtoll"
make[1]: *** [core.o] Error 1
make[1]: Leaving directory `/home/timo/SVN14/subversion-1.4.3/subversion/bindings/swig/perl/native'
make: *** [swig-pl] Error 2