rendered paste bodyptimizations -fomit-frame-pointer -frename-registers -Os -fpermissive -fvisibility-inlines-hidden -fno-exceptions -fno-rtti -nostdinc++ -fno-threadsafe-statics -MT nodes.lo -MD -MP -MF ".deps/nodes.Tpo" -c -o nodes.lo nodes.cpp; \
| then mv -f ".deps/nodes.Tpo" ".deps/nodes.Plo"; else rm -f ".deps/nodes.Tpo"; exit 1; fi
| ccache arm-angstrom-linux-gnueabi-g++ -march=armv5te -mtune=xscale -DHAVE_CONFIG_H -I. -I/usr/src/universal/angstrom/build_htcuniversal/work/armv5te-angstrom-linux-gnueabi/osb-jscore-0.5.0+cvs20060212-r0/JavaScriptCore/kjs -I.. -include /usr/src/universal/angstrom/build_htcuniversal/work/armv5te-angstrom-linux-gnueabi/osb-jscore-0.5.0+cvs20060212-r0/JavaScriptCore/JavaScriptCorePrefix.h -DKWIQ -DAPPLE_CHANGES -DHAVE_PCREPOSIX -DNDEBUG -I/usr/src/universal/angstrom/build_htcuniversal/staging/arm-angstrom-linux-gnueabi/include/glib-2.0 -I/usr/src/universal/angstrom/build_htcuniversal/staging/arm-angstrom-linux-gnueabi/lib/glib-2.0/include -I/usr/src/universal/angstrom/build_htcuniversal/work/armv5te-angstrom-linux-gnueabi/osb-jscore-0.5.0+cvs20060212-r0/JavaScriptCore/kjs -I/usr/src/universal/angstrom/build_htcuniversal/work/armv5te-angstrom-linux-gnueabi/osb-jscore-0.5.0+cvs20060212-r0/JavaScriptCore/pcre -I/usr/src/universal/angstrom/build_htcuniversal/work/armv5te-angstrom-linux-gnueabi/osb-jscore-0.5.0+cvs20060212-r0/JavaScriptCore/ -isystem/usr/src/universal/angstrom/build_htcuniversal/staging/arm-angstrom-linux-gnueabi/include -fexpensive-optimizations -fomit-frame-pointer -frename-registers -Os -fpermissive -fvisibility-inlines-hidden -fno-exceptions -fno-rtti -nostdinc++ -fno-threadsafe-statics -MT nodes.lo -MD -MP -MF .deps/nodes.Tpo -c nodes.cpp -fPIC -DPIC -o .libs/nodes.o
| protected_values.h:53: warning: extra qualification 'KJS::ProtectedValues::' on member '_table'
| protected_values.h:54: warning: extra qualification 'KJS::ProtectedValues::' on member '_tableSize'
| protected_values.h:55: warning: extra qualification 'KJS::ProtectedValues::' on member '_tableSizeMask'
| protected_values.h:56: warning: extra qualification 'KJS::ProtectedValues::' on member '_keyCount'
| ccache arm-angstrom-linux-gnueabi-g++ -march=armv5te -mtune=xscale -DHAVE_CONFIG_H -I. -I/usr/src/universal/angstrom/build_htcuniversal/work/armv5te-angstrom-linux-gnueabi/osb-jscore-0.5.0+cvs20060212-r0/JavaScriptCore/kjs -I.. -include /usr/src/universal/angstrom/build_htcuniversal/work/armv5te-angstrom-linux-gnueabi/osb-jscore-0.5.0+cvs20060212-r0/JavaScriptCore/JavaScriptCorePrefix.h -DKWIQ -DAPPLE_CHANGES -DHAVE_PCREPOSIX -DNDEBUG -I/usr/src/universal/angstrom/build_htcuniversal/staging/arm-angstrom-linux-gnueabi/include/glib-2.0 -I/usr/src/universal/angstrom/build_htcuniversal/staging/arm-angstrom-linux-gnueabi/lib/glib-2.0/include -I/usr/src/universal/angstrom/build_htcuniversal/work/armv5te-angstrom-linux-gnueabi/osb-jscore-0.5.0+cvs20060212-r0/JavaScriptCore/kjs -I/usr/src/universal/angstrom/build_htcuniversal/work/armv5te-angstrom-linux-gnueabi/osb-jscore-0.5.0+cvs20060212-r0/JavaScriptCore/pcre -I/usr/src/universal/angstrom/build_htcuniversal/work/armv5te-angstrom-linux-gnueabi/osb-jscore-0.5.0+cvs20060212-r0/JavaScriptCore/ -isystem/usr/src/universal/angstrom/build_htcuniversal/staging/arm-angstrom-linux-gnueabi/include -fexpensive-optimizations -fomit-frame-pointer -frename-registers -Os -fpermissive -fvisibility-inlines-hidden -fno-exceptions -fno-rtti -nostdinc++ -fno-threadsafe-statics -MT nodes.lo -MD -MP -MF .deps/nodes.Tpo -c nodes.cpp -o nodes.o >/dev/null 2>&1
| if /bin/sh ../arm-angstrom-linux-gnueabi-libtool --tag=CXX --mode=compile ccache arm-angstrom-linux-gnueabi-g++ -march=armv5te -mtune=xscale -DHAVE_CONFIG_H -I. -I/usr/src/universal/angstrom/build_htcuniversal/work/armv5te-angstrom-linux-gnueabi/osb-jscore-0.5.0+cvs20060212-r0/JavaScriptCore/kjs -I.. -include /usr/src/universal/angstrom/build_htcuniversal/work/armv5te-angstrom-linux-gnueabi/osb-jscore-0.5.0+cvs20060212-r0/JavaScriptCore/JavaScriptCorePrefix.h -DKWIQ -DAPPLE_CHANGES -DHAVE_PCREPOSIX -DNDEBUG -I/usr/src/universal/angstrom/build_htcuniversal/staging/arm-angstrom-linux-gnueabi/include/glib-2.0 -I/usr/src/universal/angstrom/build_htcuniversal/staging/arm-angstrom-linux-gnueabi/lib/glib-2.0/include -I/usr/src/universal/angstrom/build_htcuniversal/work/armv5te-angstrom-linux-gnueabi/osb-jscore-0.5.0+cvs20060212-r0/JavaScriptCore/kjs -I/usr/src/universal/angstrom/build_htcuniversal/work/armv5te-angstrom-linux-gnueabi/osb-jscore-0.5.0+cvs20060212-r0/JavaScriptCore/pcre -I/usr/src/universal/angstrom/build_htcuniversal/work/armv5te-angstrom-linux-gnueabi/osb-jscore-0.5.0+cvs20060212-r0/JavaScriptCore/ -isystem/usr/src/universal/angstrom/build_htcuniversal/staging/arm-angstrom-linux-gnueabi/include -fexpensive-optimizations -fomit-frame-pointer -frename-registers -Os -fpermissive -fvisibility-inlines-hidden -fno-exceptions -fno-rtti -nostdinc++ -fno-threadsafe-statics -MT number_object.lo -MD -MP -MF ".deps/number_object.Tpo" -c -o number_object.lo number_object.cpp; \
| then mv -f ".deps/number_object.Tpo" ".deps/number_object.Plo"; else rm -f ".deps/number_object.Tpo"; exit 1; fi
| ccache arm-angstrom-linux-gnueabi-g++ -march=armv5te -mtune=xscale -DHAVE_CONFIG_H -I. -I/usr/src/universal/angstrom/build_htcuniversal/work/armv5te-angstrom-linux-gnueabi/osb-jscore-0.5.0+cvs20060212-r0/JavaScriptCore/kjs -I.. -include /usr/src/universal/angstrom/build_htcuniversal/work/armv5te-angstrom-linux-gnueabi/osb-jscore-0.5.0+cvs20060212-r0/JavaScriptCore/JavaScriptCorePrefix.h -DKWIQ -DAPPLE_CHANGES -DHAVE_PCREPOSIX -DNDEBUG -I/usr/src/universal/angstrom/build_htcuniversal/staging/arm-angstrom-linux-gnueabi/include/glib-2.0 -I/usr/src/universal/angstrom/build_htcuniversal/staging/arm-angstrom-linux-gnueabi/lib/glib-2.0/include -I/usr/src/universal/angstrom/build_htcuniversal/work/armv5te-angstrom-linux-gnueabi/osb-jscore-0.5.0+cvs20060212-r0/JavaScriptCore/kjs -I/usr/src/universal/angstrom/build_htcuniversal/work/armv5te-angstrom-linux-gnueabi/osb-jscore-0.5.0+cvs20060212-r0/JavaScriptCore/pcre -I/usr/src/universal/angstrom/build_htcuniversal/work/armv5te-angstrom-linux-gnueabi/osb-jscore-0.5.0+cvs20060212-r0/JavaScriptCore/ -isystem/usr/src/universal/angstrom/build_htcuniversal/staging/arm-angstrom-linux-gnueabi/include -fexpensive-optimizations -fomit-frame-pointer -frename-registers -Os -fpermissive -fvisibility-inlines-hidden -fno-exceptions -fno-rtti -nostdinc++ -fno-threadsafe-statics -MT number_object.lo -MD -MP -MF .deps/number_object.Tpo -c number_object.cpp -fPIC -DPIC -o .libs/number_object.o
| protected_values.h:53: warning: extra qualification 'KJS::ProtectedValues::' on member '_table'
| protected_values.h:54: warning: extra qualification 'KJS::ProtectedValues::' on member '_tableSize'
| protected_values.h:55: warning: extra qualification 'KJS::ProtectedValues::' on member '_tableSizeMask'
| protected_values.h:56: warning: extra qualification 'KJS::ProtectedValues::' on member '_keyCount'
| arm-angstrom-linux-gnueabi-g++: Internal error: Segmentation fault (program as)
| Please submit a full bug report.
| See <URL:http://gcc.gnu.org/bugs.html> for instructions.
| make[3]: *** [number_object.lo] Fejl 1
| make[3]: Forlader katalog '/usr/src/universal/angstrom/build_htcuniversal/work/armv5te-angstrom-linux-gnueabi/osb-jscore-0.5.0+cvs20060212-r0/JavaScriptCore/kjs'
| make[2]: *** [all] Fejl 2
| make[2]: Forlader katalog '/usr/src/universal/angstrom/build_htcuniversal/work/armv5te-angstrom-linux-gnueabi/osb-jscore-0.5.0+cvs20060212-r0/JavaScriptCore/kjs'
| make[1]: *** [all-recursive] Fejl 1
| make[1]: Forlader katalog '/usr/src/universal/angstrom/build_htcuniversal/work/armv5te-angstrom-linux-gnueabi/osb-jscore-0.5.0+cvs20060212-r0/JavaScriptCore'
| make: *** [all] Fejl 2
| FATAL: oe_runmake failed
NOTE: Task failed: /usr/src/universal/angstrom/build_htcuniversal/work/armv5te-angstrom-linux-gnueabi/osb-jscore-0.5.0+cvs20060212-r0/temp/log.do_compile.2823
NOTE: package osb-jscore-0.5.0+cvs20060212-r0: task do_compile: failed
ERROR: TaskFailed event exception, aborting
NOTE: package osb-jscore-0.5.0+cvs20060212: failed
ERROR: Build of osb-jscore failed