All pastes #35167 Raw Edit

Erreur make CVS

public text v1 · immutable
#35167 ·published 2005-12-29 15:56 UTC
rendered paste body
--------- Error log - file /home/klomac/.WineCVS/sources/cvscedega/ErrorLog : ---------
make[1]: entrant dans le répertoire « /home/klomac/.WineCVS/sources/cvscedega/winex/unicode »
make[1]: « libwine_unicode.so » est à jour.
make[1]: quittant le répertoire « /home/klomac/.WineCVS/sources/cvscedega/winex/unicode »
make[1]: entrant dans le répertoire « /home/klomac/.WineCVS/sources/cvscedega/winex/tools »
make[2]: entrant dans le répertoire « /home/klomac/.WineCVS/sources/cvscedega/winex/tools/winebuild »
make[2]: Rien à faire pour « all ».
make[2]: quittant le répertoire « /home/klomac/.WineCVS/sources/cvscedega/winex/tools/winebuild »
make[2]: entrant dans le répertoire « /home/klomac/.WineCVS/sources/cvscedega/winex/tools/winedump »
make[2]: Rien à faire pour « all ».
make[2]: quittant le répertoire « /home/klomac/.WineCVS/sources/cvscedega/winex/tools/winedump »
make[2]: entrant dans le répertoire « /home/klomac/.WineCVS/sources/cvscedega/winex/tools/wmc »
make[2]: Rien à faire pour « all ».
make[2]: quittant le répertoire « /home/klomac/.WineCVS/sources/cvscedega/winex/tools/wmc »
make[2]: entrant dans le répertoire « /home/klomac/.WineCVS/sources/cvscedega/winex/tools/wrc »
gcc -MMD -c  -I. -I. -I../../include -I../../include  -g -O2 -Wall -mpreferred-stack-boundary=2 -fno-keep-static-consts -D__const=const -fno-strict-aliasing -D__int8=char -D__int16=short -D__int32=int "-D__int64=long long" -D__WINE__ -D_REENTRANT  -o newstruc.o newstruc.c
newstruc.c: In function ‘handle_ani_list’:
newstruc.c:740: erreur: invalid lvalue in increment
newstruc.c: In function ‘new_ani_curico’:
newstruc.c:851: erreur: invalid lvalue in increment
make[2]: *** [newstruc.o] Erreur 1
make[2]: quittant le répertoire « /home/klomac/.WineCVS/sources/cvscedega/winex/tools/wrc »
make[1]: *** [wrc] Erreur 2
make[1]: quittant le répertoire « /home/klomac/.WineCVS/sources/cvscedega/winex/tools »
make: *** [tools] Erreur 2


Error in Make

Try fixing the error based on the output above, and
run the script again, without paramaters (Eg: WineCVS.sh)