All pastes #35097 Raw Edit

Something

public text v1 · immutable
#35097 ·published 2005-12-28 22:21 UTC
rendered paste body
 gcc -DPACKAGE_NAME=\"libchroma\" -DPACKAGE_TARNAME=\"libchroma\" -DPACKAGE_VERSION=\"0.1\" "-DPACKAGE_STRING=\"libchroma 0.1\"" -DPACKAGE_BUGREPORT=\"\" -DPACKAGE=\"libchroma\" -DVERSION=\"0.1\" -DSTDC_HEADERS=1 -DHAVE_SYS_TYPES_H=1 -DHAVE_SYS_STAT_H=1 -DHAVE_STDLIB_H=1 -DHAVE_STRING_H=1 -DHAVE_MEMORY_H=1 -DHAVE_STRINGS_H=1 -DHAVE_INTTYPES_H=1 -DHAVE_STDINT_H=1 -DHAVE_UNISTD_H=1 -DHAVE_DLFCN_H=1 -I. -I. -DXTHREADS -DXUSE_MTSAFE_API -I/usr/local/include/atk-1.0 -I/usr/local/include/cairo -I/usr/local/include/glib-2.0 -I/usr/local/lib/glib-2.0/include -I/usr/X11R6/include/gtk-2.0 -I/usr/X11R6/lib/gtk-2.0/include -I/usr/X11R6/include/pango-1.0 -I/usr/X11R6/include -I/usr/local/include/freetype2 -I/usr/local/include -I/usr/local/include/cairo -I/usr/local/include/glib-2.0 -I/usr/local/lib/glib-2.0/include -I/usr/X11R6/include/pango-1.0 -I/usr/X11R6/include -I/usr/local/include/freetype2 -I/usr/local/include -I../include -I/usr/local/include -D__BSD_VISIBLE -g -g -O2 -Wall -pedantic -std=c99 -MT chroma-list.lo -MD -MP -MF .deps/chroma-list.Tpo -c chroma-list.c  -fPIC -DPIC -o .libs/chroma-list.o
chroma-list.c:126: error: syntax error before "ChromaListCellDataFunc"
chroma-list.c:307: error: syntax error before "ChromaListCellDataFunc"
chroma-list.c: In function `chroma_list_set_cell_data_func':
chroma-list.c:310: error: `self' undeclared (first use in this function)
chroma-list.c:310: error: (Each undeclared identifier is reported only once
chroma-list.c:310: error: for each function it appears in.)
chroma-list.c:311: error: `column' undeclared (first use in this function)
chroma-list.c:313: error: `cell_data_func' undeclared (first use in this function)
chroma-list.c:314: error: `data' undeclared (first use in this function)
chroma-list.c: At top level:
chroma-list.c:368: error: conflicting types for 'chroma_list_set_column_width'
/usr/local/include/libchroma/chroma-list.h:94: error: previous declaration of 'chroma_list_set_column_width' was here
chroma-list.c:368: error: conflicting types for 'chroma_list_set_column_width'
/usr/local/include/libchroma/chroma-list.h:94: error: previous declaration of 'chroma_list_set_column_width' was here
chroma-list.c:386: error: conflicting types for 'chroma_list_get_column'
/usr/local/include/libchroma/chroma-list.h:82: error: previous declaration of 'chroma_list_get_column' was here
chroma-list.c:386: error: conflicting types for 'chroma_list_get_column'
/usr/local/include/libchroma/chroma-list.h:82: error: previous declaration of 'chroma_list_get_column' was here
chroma-list.c: In function `render_row':
chroma-list.c:436: warning: implicit declaration of function `chroma_list_selection_iface_get_type'
chroma-list.c:507: error: structure has no member named `cell_data_funcs'
chroma-list.c:509: error: structure has no member named `cell_data_funcs'
chroma-list.c: In function `chroma_list_button_press':
chroma-list.c:833: warning: implicit declaration of function `chroma_list_selection_unselect_all'
chroma-list.c: At top level:
chroma-list.c:1427: error: conflicting types for 'chroma_list_get_model'
/usr/local/include/libchroma/chroma-list.h:79: error: previous declaration of 'chroma_list_get_model' was here
chroma-list.c:1427: error: conflicting types for 'chroma_list_get_model'
/usr/local/include/libchroma/chroma-list.h:79: error: previous declaration of 'chroma_list_get_model' was here
chroma-list.c: In function `chroma_list_set_model':
chroma-list.c:1672: error: structure has no member named `cell_data_funcs'
chroma-list.c:1672: error: `ChromaListCellDataFunc' undeclared (first use in this function)
chroma-list.c:1672: error: syntax error before ')' token
chroma-list.c: In function `list_selection_path_set_selected':
chroma-list.c:2328: warning: implicit declaration of function `chroma_list_selection_path_get_selected'
chroma-list.c: In function `chroma_list_selection_init':
chroma-list.c:2432: error: structure has no member named `path_get_selected'
chroma-list.c:2433: error: structure has no member named `path_set_selected'
chroma-list.c:2435: error: structure has no member named `unselect_all'
chroma-list.c:2437: error: structure has no member named `remove_selected'
gmake[1]: *** [chroma-list.lo] Erreur 1
gmake[1]: Leaving directory `/usr/home/david/dev/cvs/bmpx/bmpx/libchroma/libchroma'
gmake: *** [all-recursive] Erreur 1