All pastes #35044 Raw Edit

Untitled

public text v1 · immutable
#35044 ·published 2005-12-28 07:22 UTC
rendered paste body
[root@radio asterisk]# make
build_tools/make_version_h > include/asterisk/version.h.tmp
if cmp -s include/asterisk/version.h.tmp include/asterisk/version.h ; then echo; else \
        mv include/asterisk/version.h.tmp include/asterisk/version.h ; \
fi

rm -f include/asterisk/version.h.tmp
if cmp -s .cleancount .lastclean ; then echo ; else \
        make clean; cp -f .cleancount .lastclean;\
fi

build_tools/make_defaults_h > defaults.h.tmp
if cmp -s defaults.h.tmp defaults.h ; then echo ; else \
        mv defaults.h.tmp defaults.h ; \
fi

rm -f defaults.h.tmp
for x in res channels pbx apps codecs formats agi cdr funcs utils stdtime; do make -C $x depend || exit 1 ; done
make[1]: Entering directory `/usr/src/asterisk/res'
make[1]: Nothing to be done for `depend'.
make[1]: Leaving directory `/usr/src/asterisk/res'
make[1]: Entering directory `/usr/src/asterisk/channels'
make[1]: Nothing to be done for `depend'.
make[1]: Leaving directory `/usr/src/asterisk/channels'
make[1]: Entering directory `/usr/src/asterisk/pbx'
make[1]: Nothing to be done for `depend'.
make[1]: Leaving directory `/usr/src/asterisk/pbx'
make[1]: Entering directory `/usr/src/asterisk/apps'
make[1]: Nothing to be done for `depend'.
make[1]: Leaving directory `/usr/src/asterisk/apps'
make[1]: Entering directory `/usr/src/asterisk/codecs'
make[1]: Nothing to be done for `depend'.
make[1]: Leaving directory `/usr/src/asterisk/codecs'
make[1]: Entering directory `/usr/src/asterisk/formats'
make[1]: Nothing to be done for `depend'.
make[1]: Leaving directory `/usr/src/asterisk/formats'
make[1]: Entering directory `/usr/src/asterisk/agi'
make[1]: Nothing to be done for `depend'.
make[1]: Leaving directory `/usr/src/asterisk/agi'
make[1]: Entering directory `/usr/src/asterisk/cdr'
make[1]: Nothing to be done for `depend'.
make[1]: Leaving directory `/usr/src/asterisk/cdr'
make[1]: Entering directory `/usr/src/asterisk/funcs'
make[1]: Nothing to be done for `depend'.
make[1]: Leaving directory `/usr/src/asterisk/funcs'
make[1]: Entering directory `/usr/src/asterisk/utils'
make[1]: Nothing to be done for `depend'.
make[1]: Leaving directory `/usr/src/asterisk/utils'
make[1]: Entering directory `/usr/src/asterisk/stdtime'
make[1]: Nothing to be done for `depend'.
make[1]: Leaving directory `/usr/src/asterisk/stdtime'
cd editline && unset CFLAGS LIBS && test -f config.h || ./configure
make -C editline libedit.a
make[1]: Entering directory `/usr/src/asterisk/editline'
make[1]: `libedit.a' is up to date.
make[1]: Leaving directory `/usr/src/asterisk/editline'
make[1]: Entering directory `/usr/src/asterisk/db1-ast'
make[1]: `libdb1.a' is up to date.
make[1]: Leaving directory `/usr/src/asterisk/db1-ast'
make[1]: Entering directory `/usr/src/asterisk/stdtime'
make[1]: `libtime.a' is up to date.
make[1]: Leaving directory `/usr/src/asterisk/stdtime'
for x in res channels pbx apps codecs formats agi cdr funcs utils stdtime; do make -C $x || exit 1 ; done
make[1]: Entering directory `/usr/src/asterisk/res'
make[1]: Nothing to be done for `all'.
make[1]: Leaving directory `/usr/src/asterisk/res'
make[1]: Entering directory `/usr/src/asterisk/channels'
make[1]: Nothing to be done for `all'.
make[1]: Leaving directory `/usr/src/asterisk/channels'
make[1]: Entering directory `/usr/src/asterisk/pbx'
make[1]: Nothing to be done for `all'.
make[1]: Leaving directory `/usr/src/asterisk/pbx'
make[1]: Entering directory `/usr/src/asterisk/apps'
gcc  -pipe  -Wall -Wstrict-prototypes -Wmissing-prototypes -Wmissing-declarations -g3  -Iinclude -I../include -D_REENTRANT -D_GNU_SOURCE  -O6 -march=i686 -DZAPTEL_OPTIMIZATIONS         -fomit-frame-pointer  -fPIC   -c -o app_nv_faxdetect.o app_nv_faxdetect.c
In file included from app_nv_faxdetect.c:26:
../include/asterisk/file.h:27:2: #error You must include stdio.h before file.h!
In file included from app_nv_faxdetect.c:26:
../include/asterisk/file.h:56: error: syntax error before '*' token
../include/asterisk/file.h:56: warning: function declaration isn't a prototype
../include/asterisk/file.h:57: error: syntax error before '*' token
../include/asterisk/file.h:57: warning: function declaration isn't a prototype
app_nv_faxdetect.c: In function `nv_detectfax_exec':
app_nv_faxdetect.c:123: warning: implicit declaration of function `sscanf'
app_nv_faxdetect.c:269: warning: implicit declaration of function `sprintf'
make[1]: *** [app_nv_faxdetect.o] Error 1
make[1]: Leaving directory `/usr/src/asterisk/apps'
make: *** [subdirs] Error 1