rendered paste body- evas ....................... ERROR!
--------------------------------------------------------------------------------
----------------------------------- Last loglines ------------------------------
make[4]: Leaving directory `/home/raven301/e17_cvs/e17/libs/evas/src/lib'
make[3]: Leaving directory `/home/raven301/e17_cvs/e17/libs/evas/src/lib'
make[2]: Leaving directory `/home/raven301/e17_cvs/e17/libs/evas/src/lib'
Making install in modules
make[2]: Entering directory `/home/raven301/e17_cvs/e17/libs/evas/src/modules'
Making install in engines
make[3]: Entering directory `/home/raven301/e17_cvs/e17/libs/evas/src/modules/engines'
Making install in software_generic
make[4]: Entering directory `/home/raven301/e17_cvs/e17/libs/evas/src/modules/engines/software_generic'
make[5]: Entering directory `/home/raven301/e17_cvs/e17/libs/evas/src/modules/engines/software_generic'
make[5]: Nothing to be done for `install-exec-am'.
test -z "/opt/e17/lib/evas/modules/engines/software_generic/linux-gnu-i686" || mkdir -p -- "/opt/e17/lib/evas/modules/engines/software_generic/linux-gnu-i686"
/bin/bash ../../../../libtool --mode=install /usr/bin/install -c 'module.la' '/opt/e17/lib/evas/modules/engines/software_generic/linux-gnu-i686/module.la'
libtool: install: error: cannot install `module.la' to a directory not ending in /usr/local/lib/evas/modules/engines/software_generic/linux-gnu-i686
make[5]: *** [install-pkgLTLIBRARIES] Error 1
make[5]: Leaving directory `/home/raven301/e17_cvs/e17/libs/evas/src/modules/engines/software_generic'
make[4]: *** [install-am] Error 2
make[4]: Leaving directory `/home/raven301/e17_cvs/e17/libs/evas/src/modules/engines/software_generic'
make[3]: *** [install-recursive] Error 1
make[3]: Leaving directory `/home/raven301/e17_cvs/e17/libs/evas/src/modules/engines'
make[2]: *** [install-recursive] Error 1
make[2]: Leaving directory `/home/raven301/e17_cvs/e17/libs/evas/src/modules'
make[1]: *** [install-recursive] Error 1
make[1]: Leaving directory `/home/raven301/e17_cvs/e17/libs/evas/src'
make: *** [install-recursive] Error 1
--------------------------------------------------------------------------------