ccache gcc -c -pipe -march=pentiumpro -O3 -Wall -Wno-switch -fomit-frame-pointer -DPIC -fPIC -fno-common -w -D_REENTRANT -DMMX -Di386 -D_GNU_SOURCE -D_FILE_OFFSET_BITS=64 -DPREFIX=\"/usr/local\" -DQT_NO_DEBUG -DQT_CORE_LIB -DQT_GUI_LIB -DQT_SHARED -I/usr/share/doc/qt-4.0.1/mkspecs/linux-g++ -I. -I/usr/include/qt4/QtGui -I/usr/include/qt4/QtCore -I/usr/include/qt4 -I/usr/local/include -I/usr/include -I/usr/include -I../../libs/libavcodec -I. -I. -o motion_comp_mmx.o motion_comp_mmx.c
ccache gcc -c -pipe -march=pentiumpro -O3 -Wall -Wno-switch -fomit-frame-pointer -DPIC -fPIC -fno-common -w -D_REENTRANT -DMMX -Di386 -D_GNU_SOURCE -D_FILE_OFFSET_BITS=64 -DPREFIX=\"/usr/local\" -DQT_NO_DEBUG -DQT_CORE_LIB -DQT_GUI_LIB -DQT_SHARED -I/usr/share/doc/qt-4.0.1/mkspecs/linux-g++ -I. -I/usr/include/qt4/QtGui -I/usr/include/qt4/QtCore -I/usr/include/qt4 -I/usr/local/include -I/usr/include -I/usr/include -I../../libs/libavcodec -I. -I. -o idct_mmx.o idct_mmx.c
rm -f libmythmpeg2-0.19.a
ar cqs libmythmpeg2-0.19.a cpu_accel.o cpu_state.o alloc.o header.o decode.o slice.o motion_comp.o idct.o motion_comp_mmx.o idct_mmx.o
make[2]: Leaving directory `/root/mythtv/libs/libmythmpeg2'
cd libmyth && /usr/bin/qmake libmyth.pro -unix
cd libmyth && make
make[2]: Entering directory `/root/mythtv/libs/libmyth'
ccache g++ -c -pipe -march=pentiumpro -O3 -Wall -Wno-switch -fomit-frame-pointer -D_REENTRANT -Wall -W -DPIC -fPIC -DMMX -Di386 -D_GNU_SOURCE -D_FILE_OFFSET_BITS=64 -DPREFIX=\"/usr/local\" -DUSING_OSS -DUSE_ALSA -DUSE_JOYSTICK_MENU -DUSE_LIRC -DUSING_XRANDR -DQT_NO_DEBUG -DQT_CORE_LIB -DQT_GUI_LIB -DQT_SHARED -I/usr/share/doc/qt-4.0.1/mkspecs/linux-g++ -I. -I/usr/include/qt4/QtGui -I/usr/include/qt4/QtCore -I/usr/include/qt4 -I/usr/local/include -I/usr/include -I/usr/include -I../libmythsamplerate -I../libmythsoundtouch -I../.. -I. -I. -o dialogbox.o dialogbox.cpp
In file included from dialogbox.h:6,
from dialogbox.cpp:11:
mythdialogs.h:7:18: qdom.h: No such file or directory
mythdialogs.h:8:22: qptrlist.h: No such file or directory
mythdialogs.h:13:26: qvaluevector.h: No such file or directory
mythdialogs.h:14:25: qscrollview.h: No such file or directory
In file included from dialogbox.h:6,
from dialogbox.cpp:11:
mythdialogs.h:51: error: syntax error before `{' token
mythdialogs.h: In function `int getKeycode()':
mythdialogs.h:56: error: `keycode' undeclared (first use this function)
mythdialogs.h:56: error: (Each undeclared identifier is reported only once for
each function it appears in.)
mythdialogs.h: At global scope:
mythdialogs.h:58: error: syntax error before `private'
mythdialogs.h:63: error: syntax error before `{' token
mythdialogs.h:82: error: type specifier omitted for parameter `WFlags'
mythdialogs.h:82: error: syntax error before `=' token
mythdialogs.h:124: error: `QCustomEvent' was not declared in this scope
mythdialogs.h:124: error: `ce' was not declared in this scope
mythdialogs.h:124: error: invalid data member initialization
mythdialogs.h:124: error: (use `=' to initialize static data members)
mythdialogs.h:124: error: variable or field `customEvent' declared void
mythdialogs.h:199: error: syntax error before `*' token
mythdialogs.h:288: error: syntax error before `*' token
mythdialogs.h:348: error: `QDomElement' was not declared in this scope
mythdialogs.h:348: error: syntax error before `)' token
mythdialogs.h:349: error: `QDomElement' was not declared in this scope
mythdialogs.h:349: error: syntax error before `)' token
mythdialogs.h:350: error: `QDomElement' was not declared in this scope
mythdialogs.h:350: error: syntax error before `)' token
mythdialogs.h:351: error: `QDomElement' was not declared in this scope
mythdialogs.h:351: error: syntax error before `)' token
mythdialogs.h:397: error: syntax error before `&' token
mythdialogs.h: In member function `void MythThemedDialog::setContext(int)':
mythdialogs.h:376: error: `context' undeclared (first use this function)
mythdialogs.h: In member function `XMLParse* MythThemedDialog::getTheme()':
mythdialogs.h:396: error: `theme' undeclared (first use this function)
mythdialogs.h: At global scope:
mythdialogs.h:399: error: ISO C++ forbids defining types within return type
mythdialogs.h:399: error: syntax error before `;' token
mythdialogs.h:402: error: syntax error before `private'
mythdialogs.h:406: error: `XMLParse*theme' used prior to declaration
mythdialogs.h:407: error: 'QDomElement' is used as a type, but is not defined
as a type.
mythdialogs.h:408: error: `int context' used prior to declaration
mythdialogs.h:410: error: 'QPtrList' is used as a type, but is not defined as a
type.
mythdialogs.h:411: error: 'QPtrList' is used as a type, but is not defined as a
type.
mythdialogs.h:414: error: syntax error before `}' token
mythdialogs.h:478: error: syntax error before `*' token
mythdialogs.h:479: error: syntax error before `*' token
mythdialogs.h:493: error: ISO C++ forbids declaration of `QValueVector' with no
type
mythdialogs.h:493: error: template-id `QValueVector<int>' used as a declarator
mythdialogs.h:493: error: syntax error before `;' token
mythdialogs.h:506: error: type specifier omitted for parameter `IntVector'
mythdialogs.h:506: error: syntax error before `*' token
mythdialogs.h:507: error: type specifier omitted for parameter `IntVector'
mythdialogs.h:507: error: syntax error before `*' token
mythdialogs.h:530: error: syntax error before `{' token
mythdialogs.h:531: error: virtual outside class declaration
mythdialogs.h:531: error: non-member function `const QMetaObject* metaObject()'
cannot have `const' method qualifier
mythdialogs.h:531: error: virtual outside class declaration
mythdialogs.h: In function `QString tr(const char*, const char*)':
mythdialogs.h:531: error: `staticMetaObject' undeclared (first use this
function)
mythdialogs.h: At global scope:
mythdialogs.h:531: error: virtual outside class declaration
mythdialogs.h:531: error: syntax error before `private'
mythdialogs.h:545: error: syntax error before `*' token
mythdialogs.h:547: error: destructors must be member functions
mythdialogs.h:552: error: non-member function `int result()' cannot have `const
' method qualifier
mythdialogs.h:554: error: syntax error before `public'
mythdialogs.h:557: error: virtual outside class declaration
mythdialogs.h:558: error: virtual outside class declaration
mythdialogs.h:559: error: virtual outside class declaration
mythdialogs.h:560: error: virtual outside class declaration
mythdialogs.h:562: error: syntax error before `protected'
mythdialogs.h:565: error: virtual outside class declaration
mythdialogs.h:567: error: syntax error before `protected'
mythdialogs.h:570: error: virtual outside class declaration
mythdialogs.h:605: error: syntax error before `}' token
In file included from dialogbox.cpp:12:
mythcontext.h:9:22: qptrlist.h: No such file or directory
mythcontext.h:12:27: qsocketdevice.h: No such file or directory
mythcontext.h:14:23: qnetwork.h: No such file or directory
In file included from mythcontext.h:22,
from dialogbox.cpp:12:
mythobservable.h:4:22: qptrlist.h: No such file or directory
In file included from mythobservable.h:5,
from mythcontext.h:22,
from dialogbox.cpp:12:
mythevent.h:7:23: qdeepcopy.h: No such file or directory
In file included from mythobservable.h:5,
from mythcontext.h:22,
from dialogbox.cpp:12:
mythevent.h:16: error: syntax error before `{' token
mythevent.h:20: error: syntax error before `int'
mythevent.h:23: error: syntax error before `const'
mythevent.h:26: error: ISO C++ forbids declaration of `extradata' with no type
mythevent.h:26: error: invalid conversion from `const char*' to `int'
mythevent.h:27: error: syntax error before `}' token
mythevent.h:29: error: syntax error before `const'
mythevent.h:33: error: ISO C++ forbids declaration of `extradata' with no type
mythevent.h:33: error: redefinition of `int extradata'
mythevent.h:26: error: `int extradata' previously defined here
mythevent.h:33: error: `lextradata' was not declared in this scope
mythevent.h:34: error: syntax error before `}' token
mythevent.h:36: error: destructors must be member functions
mythevent.h:36: error: virtual outside class declaration
mythevent.h:38: error: non-member function `const QString& Message()' cannot
have `const' method qualifier
mythevent.h: In function `const QString& Message()':
mythevent.h:38: error: `message' undeclared (first use this function)
mythevent.h: At global scope:
mythevent.h:39: error: non-member function `const QString& ExtraData(int)'
cannot have `const' method qualifier
mythevent.h: In function `const QString& ExtraData(int)':
mythevent.h:39: error: invalid types `int[int]' for array subscript
mythevent.h: At global scope:
mythevent.h:40: error: non-member function `const QStringList& ExtraDataList()'
cannot have `const' method qualifier
mythevent.h: In function `const QStringList& ExtraDataList()':
mythevent.h:40: error: invalid initialization of reference of type 'const
QStringList&' from expression of type 'int'
mythevent.h: At global scope:
mythevent.h:41: error: non-member function `int ExtraDataCount()' cannot have `
const' method qualifier
mythevent.h: In function `int ExtraDataCount()':
mythevent.h:41: error: request for member `size' in `extradata', which is of
non-aggregate type `int'
mythevent.h: At global scope:
mythevent.h:43: error: syntax error before `*' token
mythevent.h:47: error: conflicting types for `QStringList extradata'
mythevent.h:33: error: previous declaration as `int extradata'
mythevent.h:48: error: syntax error before `}' token
In file included from mythcontext.h:22,
from dialogbox.cpp:12:
mythobservable.h:112: error: syntax error before `)' token
mythobservable.h:122: error: `event' was not declared in this scope
mythobservable.h:122: error: invalid data member initialization
mythobservable.h:122: error: variable or field `dispatch' declared void
mythobservable.h:133: error: `event' was not declared in this scope
mythobservable.h:133: error: invalid data member initialization
mythobservable.h:133: error: variable or field `dispatchNow' declared void
mythobservable.h:136: error: 'QPtrList' is used as a type, but is not defined
as a type.
In file included from dialogbox.cpp:13:
mythwidgets.h:4:21: qbutton.h: No such file or directory
mythwidgets.h:14:21: qheader.h: No such file or directory
mythwidgets.h:15:20: qtable.h: No such file or directory
mythwidgets.h:17:22: qlistbox.h: No such file or directory
In file included from dialogbox.cpp:13:
mythwidgets.h: In constructor `MythComboBox::MythComboBox(bool, QWidget*, const
char*)':
mythwidgets.h:44: error: no matching function for call to `QComboBox::QComboBox
(bool&, QWidget*&, const char*&)'
/usr/include/qt4/QtGui/qcombobox.h:254: error: candidates are:
QComboBox::QComboBox(const QComboBox&)
/usr/include/qt4/QtGui/qcombobox.h:62: error:
QComboBox::QComboBox(QWidget*)
mythwidgets.h: In member function `void MythComboBox::insertItem(const
QString&)':
mythwidgets.h:57: error: no matching function for call to `MythComboBox::
insertItem(const QString&)'
/usr/include/qt4/QtGui/qcombobox.h:274: error: candidates are: void
QComboBox::insertItem(int, const QString&, const QVariant&)
/usr/include/qt4/QtGui/qcombobox.h:162: error: void
QComboBox::insertItem(int, const QIcon&, const QString&, const QVariant&)
mythwidgets.h: In constructor `MythSpinBox::MythSpinBox(QWidget*, const char*,
bool)':
mythwidgets.h:78: error: no matching function for call to `QSpinBox::QSpinBox(
QWidget*&, const char*&)'
/usr/include/qt4/QtGui/qspinbox.h:98: error: candidates are:
QSpinBox::QSpinBox(const QSpinBox&)
/usr/include/qt4/QtGui/qspinbox.h:47: error:
QSpinBox::QSpinBox(QWidget*)
mythwidgets.h:78: error: `setLineStep' undeclared (first use this function)
mythwidgets.h: In constructor `MythSlider::MythSlider(QWidget*, const char*)':
mythwidgets.h:103: error: no matching function for call to `QSlider::QSlider(
QWidget*&, const char*&)'
/usr/include/qt4/QtGui/qslider.h:99: error: candidates are:
QSlider::QSlider(const QSlider&)
/usr/include/qt4/QtGui/qslider.h:63: error:
QSlider::QSlider(Qt::Orientation, QWidget*)
/usr/include/qt4/QtGui/qslider.h:62: error:
QSlider::QSlider(QWidget*)
mythwidgets.h: In constructor `MythLineEdit::MythLineEdit(QWidget*, const
char*)':
mythwidgets.h:125: error: no matching function for call to `QLineEdit::
QLineEdit(QWidget*&, const char*&)'
/usr/include/qt4/QtGui/qlineedit.h:208: error: candidates are:
QLineEdit::QLineEdit(const QLineEdit&)
/usr/include/qt4/QtGui/qlineedit.h:63: error:
QLineEdit::QLineEdit(const QString&, QWidget*)
/usr/include/qt4/QtGui/qlineedit.h:62: error:
QLineEdit::QLineEdit(QWidget*)
mythwidgets.h: In constructor `MythLineEdit::MythLineEdit(const QString&,
QWidget*, const char*)':
mythwidgets.h:129: error: no matching function for call to `QLineEdit::
QLineEdit(const QString&, QWidget*&, const char*&)'
/usr/include/qt4/QtGui/qlineedit.h:208: error: candidates are:
QLineEdit::QLineEdit(const QLineEdit&)
/usr/include/qt4/QtGui/qlineedit.h:63: error:
QLineEdit::QLineEdit(const QString&, QWidget*)
/usr/include/qt4/QtGui/qlineedit.h:62: error:
QLineEdit::QLineEdit(QWidget*)
mythwidgets.h: At global scope:
mythwidgets.h:242: error: syntax error before `{' token
mythwidgets.h:247: error: syntax error before `}' token
mythwidgets.h: In constructor `MythPushButton::MythPushButton(QWidget*, const
char*, bool)':
mythwidgets.h:263: error: no matching function for call to `QPushButton::
QPushButton(QWidget*&, const char*&)'
/usr/include/qt4/QtGui/qpushbutton.h:86: error: candidates are:
QPushButton::QPushButton(const QPushButton&)
/usr/include/qt4/QtGui/qpushbutton.h:45: error:
QPushButton::QPushButton(const QIcon&, const QString&, QWidget*)
/usr/include/qt4/QtGui/qpushbutton.h:44: error:
QPushButton::QPushButton(const QString&, QWidget*)
/usr/include/qt4/QtGui/qpushbutton.h:43: error:
QPushButton::QPushButton(QWidget*)
mythwidgets.h:263: error: `WindowOrigin' undeclared (first use this function)
mythwidgets.h:263: error: `setBackgroundOrigin' undeclared (first use this
function)
mythwidgets.h: In constructor `MythPushButton::MythPushButton(const QString&,
QWidget*, bool)':
mythwidgets.h:267: error: `setBackgroundOrigin' undeclared (first use this
function)
mythwidgets.h: In constructor `MythCheckBox::MythCheckBox(QWidget*, const
char*)':
mythwidgets.h:294: error: no matching function for call to `QCheckBox::
QCheckBox(QWidget*&, const char*&)'
/usr/include/qt4/QtGui/qcheckbox.h:81: error: candidates are:
QCheckBox::QCheckBox(const QCheckBox&)
/usr/include/qt4/QtGui/qcheckbox.h:42: error:
QCheckBox::QCheckBox(const QString&, QWidget*)
/usr/include/qt4/QtGui/qcheckbox.h:41: error:
QCheckBox::QCheckBox(QWidget*)
mythwidgets.h: In constructor `MythRadioButton::MythRadioButton(QWidget*, const
char*)':
mythwidgets.h:314: error: no matching function for call to `QRadioButton::
QRadioButton(QWidget*&, const char*&)'
/usr/include/qt4/QtGui/qradiobutton.h:53: error: candidates are:
QRadioButton::QRadioButton(const QRadioButton&)
/usr/include/qt4/QtGui/qradiobutton.h:38: error:
QRadioButton::QRadioButton(const QString&, QWidget*)
/usr/include/qt4/QtGui/qradiobutton.h:37: error:
QRadioButton::QRadioButton(QWidget*)
mythwidgets.h: At global scope:
mythwidgets.h:335: error: syntax error before `*' token
mythwidgets.h:342: error: syntax error before `{' token
mythwidgets.h:343: error: virtual outside class declaration
mythwidgets.h:343: error: non-member function `const QMetaObject* metaObject()'
cannot have `const' method qualifier
mythwidgets.h:343: error: virtual outside class declaration
mythwidgets.h: In function `QString tr(const char*, const char*)':
mythwidgets.h:343: error: redefinition of `QString tr(const char*, const char*)
'
mythdialogs.h:531: error: `QString tr(const char*, const char*)' previously
defined here
mythwidgets.h:343: error: redefinition of `QString tr(const char*, const char*)
'
mythdialogs.h:531: error: `QString tr(const char*, const char*)' previously
defined here
mythwidgets.h: In function `QString trUtf8(const char*, const char*)':
mythwidgets.h:343: error: redefinition of `QString trUtf8(const char*, const
char*)'
mythdialogs.h:531: error: `QString trUtf8(const char*, const char*)' previously
defined here
mythwidgets.h:343: error: redefinition of `QString trUtf8(const char*, const
char*)'
mythdialogs.h:531: error: `QString trUtf8(const char*, const char*)' previously
defined here
mythwidgets.h: At global scope:
mythwidgets.h:343: error: virtual outside class declaration
mythwidgets.h:343: error: syntax error before `private'
mythwidgets.h:347: error: virtual outside class declaration
mythwidgets.h: In function `void setHelpText(QString)':
mythwidgets.h:349: error: `helptext' undeclared (first use this function)
mythwidgets.h: At global scope:
mythwidgets.h:351: error: syntax error before `protected'
mythwidgets.h:354: error: virtual outside class declaration
mythwidgets.h:356: error: syntax error before `public'
mythwidgets.h: In function `void setCurrentItem(int)':
mythwidgets.h:359: error: `QListBox' undeclared (first use this function)
mythwidgets.h:359: error: syntax error before `::' token
mythwidgets.h: At global scope:
mythwidgets.h:361: error: syntax error before `protected'
mythwidgets.h:366: error: syntax error before `private'
dialogbox.cpp: In constructor `DialogBox::DialogBox(MythMainWindow*, const
QString&, const char*, const char*)':
dialogbox.cpp:21: error: `setBackgroundOrigin' undeclared (first use this
function)
dialogbox.cpp:22: error: `WordBreak' undeclared in namespace `Qt'
dialogbox.cpp:24: error: no matching function for call to `QVBoxLayout::
QVBoxLayout(DialogBox* const, int, int)'
/usr/include/qt4/QtGui/qboxlayout.h:136: error: candidates are:
QVBoxLayout::QVBoxLayout(const QVBoxLayout&)
/usr/include/qt4/QtGui/qboxlayout.h:124: error:
QVBoxLayout::QVBoxLayout(QWidget*)
/usr/include/qt4/QtGui/qboxlayout.h:123: error:
QVBoxLayout::QVBoxLayout()
dialogbox.cpp:40: error: `insert' undeclared (first use this function)
dialogbox.cpp: In member function `void DialogBox::AddButton(const QString&)':
dialogbox.cpp:48: error: `count' undeclared (first use this function)
dialogbox.cpp:54: error: `insert' undeclared (first use this function)
dialogbox.cpp: In member function `void DialogBox::buttonPressed(int)':
dialogbox.cpp:61: error: `find' undeclared (first use this function)
mythwidgets.h: In function `void setCurrentItem(int)':
mythwidgets.h:359: warning: unused parameter `int index'
{standard input}: Assembler messages:
{standard input}:195: Error: symbol `extradata' is already defined
make[2]: *** [dialogbox.o] Error 1
make[2]: Leaving directory `/root/mythtv/libs/libmyth'
make[1]: *** [sub-libmyth-make_default-ordered] Error 2
make[1]: Leaving directory `/root/mythtv/libs'
make: *** [sub-libs-make_default-ordered] Error 2