e-msgport.c:39:18: error: nspr.h: No such file or directory
e-msgport.c:500: error: expected specifier-qualifier-list before 'PRFileDesc'
e-msgport.c:515: error: expected ')' before '*' token
e-msgport.c: In function 'e_msgport_new':
e-msgport.c:542: warning: implicit declaration of function 'e_prpipe'
e-msgport.c:542: error: 'union <anonymous>' has no member named 'pipe'
e-msgport.c: In function 'e_msgport_destroy':
e-msgport.c:558: error: 'union <anonymous>' has no member named 'fd'
e-msgport.c:559: warning: implicit declaration of function 'PR_Close'
e-msgport.c:559: error: 'union <anonymous>' has no member named 'fd'
e-msgport.c:560: error: 'union <anonymous>' has no member named 'fd'
e-msgport.c: At top level:
e-msgport.c:573: error: expected '=', ',', ';', 'asm' or '__attribute__' before '*' token
e-msgport.c: In function 'e_msgport_put':
e-msgport.c:582: error: 'PRFileDesc' undeclared (first use in this function)
e-msgport.c:582: error: (Each undeclared identifier is reported only once
e-msgport.c:582: error: for each function it appears in.)
e-msgport.c:582: error: 'prfd' undeclared (first use in this function)
e-msgport.c:597: error: 'union <anonymous>' has no member named 'fd'
e-msgport.c:605: warning: implicit declaration of function 'PR_Write'
e-msgport.c:606: warning: implicit declaration of function 'PR_GetError'
e-msgport.c:606: error: 'PR_PENDING_INTERRUPT_ERROR' undeclared (first use in this function)
e-msgport.c: In function 'e_msgport_wait':
e-msgport.c:649: error: 'union <anonymous>' has no member named 'fd'
e-msgport.c:650: error: 'PRPollDesc' undeclared (first use in this function)
e-msgport.c:650: error: expected ';' before 'rfds'
e-msgport.c:656: error: 'rfds' undeclared (first use in this function)
e-msgport.c:656: error: 'union <anonymous>' has no member named 'fd'
e-msgport.c:657: error: 'PR_POLL_READ' undeclared (first use in this function)
e-msgport.c:657: error: 'PR_POLL_ERR' undeclared (first use in this function)
e-msgport.c:658: warning: implicit declaration of function 'PR_Poll'
e-msgport.c:658: error: 'PR_INTERVAL_NO_TIMEOUT' undeclared (first use in this function)
e-msgport.c:658: error: 'PR_PENDING_INTERRUPT_ERROR' undeclared (first use in this function)
e-msgport.c: In function 'e_msgport_get':
e-msgport.c:697: error: 'union <anonymous>' has no member named 'fd'
e-msgport.c:699: warning: implicit declaration of function 'PR_Read'
e-msgport.c:699: error: 'union <anonymous>' has no member named 'fd'
e-msgport.c:700: error: 'PR_PENDING_INTERRUPT_ERROR' undeclared (first use in this function)
make[2]: *** [e-msgport.lo] Error 1
make[2]: Leaving directory `/home/novell/cvs/gnome2/evolution-data-server/libedataserver'
make[1]: *** [all-recursive] Error 1
make[1]: Leaving directory `/home/novell/cvs/gnome2/evolution-data-server'
make: *** [all] Error 2
*** error during stage build of evolution-data-server: Error running make *** [1/1]
[1] rerun stage build
[2] ignore error and continue to install
[3] give up on module
[4] start shell
[5] go to stage force_checkout
[6] go to stage configure