All pastes #34864 Raw Edit

mike

public text v1 · immutable
#34864 ·published 2005-12-25 19:54 UTC
rendered paste body
cd src && make -f Makefile
make[1]: Entering directory `/data/svn/mediatagtools/src'
g++ -c -pipe -Wall -W -g `taglib-config --cflags` -static   -I/usr/share/qt3/mkspecs/default -I. -I/usr/share/qt3/include -o alistviewitem.o alistviewitem.cpp
make[1]: Leaving directory `/data/svn/mediatagtools/src'
In file included from alistviewitem.cpp:19:
alistviewitem.h:15:23: qlistview.h: Δεν υπάρχει τέτοιο αρχείο ή κατάλογος
In file included from alistviewitem.cpp:19:
alistviewitem.h:22: error: σφάλμα επεξεργασίας before `{' 
   token
alistviewitem.h:25: error: σφάλμα επεξεργασίας before `*' 
   token
alistviewitem.h:27: error: destructors must be member functions
alistviewitem.h:29: error: `QString' was not declared in this scope
alistviewitem.h:29: error: σφάλμα επεξεργασίας before `)' 
   token
alistviewitem.h:33: error: σφάλμα επεξεργασίας before `)' 
   token
alistviewitem.h:39: error: σφάλμα επεξεργασίας before `
   private'
alistviewitem.h:42: error: 'QString' is used as a type, but is not defined as a 
   type.
alistviewitem.h:43: error: σφάλμα επεξεργασίας before `}' 
   token
alistviewitem.cpp:21: error: `QListView' was not declared in this scope
alistviewitem.cpp:21: error: `parent' was not declared in this scope
alistviewitem.cpp:22: error: invalid use of undefined type `class AListViewItem
   '
alistviewitem.h:21: error: forward declaration of `class AListViewItem'
alistviewitem.cpp:22: error: invalid declarator
alistviewitem.cpp:22: error: σφάλμα σύνταξης before `:' token
alistviewitem.cpp:25: error: ISO C++ forbids declaration of `ismpeg' with no 
   type
alistviewitem.cpp:25: error: conflicting types for `int ismpeg'
alistviewitem.h:41: error: previous declaration as `bool ismpeg'
alistviewitem.cpp:26: error: ISO C++ forbids declaration of `isogg' with no 
   type
alistviewitem.cpp:26: error: conflicting types for `int isogg'
alistviewitem.h:41: error: previous declaration as `bool isogg'
alistviewitem.cpp:27: error: ISO C++ forbids declaration of `isflac' with no 
   type
alistviewitem.cpp:27: error: conflicting types for `int isflac'
alistviewitem.h:41: error: previous declaration as `bool isflac'
alistviewitem.cpp:28: error: σφάλμα επεξεργασίας before `}' 
   token
alistviewitem.cpp:30: error: `QListView' was not declared in this scope
alistviewitem.cpp:30: error: `parent' was not declared in this scope
alistviewitem.cpp:30: error: `QString' was not declared in this scope
alistviewitem.cpp:30: error: σφάλμα επεξεργασίας before `,' 
   token
alistviewitem.cpp:31: error: invalid use of undefined type `class AListViewItem
   '
alistviewitem.h:21: error: forward declaration of `class AListViewItem'
alistviewitem.cpp: In constructor `AListViewItem::AListViewItem(...)':
alistviewitem.cpp:31: error: class `AListViewItem' does not have any field 
   named `QListViewItem'
alistviewitem.cpp:31: error: `parent' undeclared (first use this function)
alistviewitem.cpp:31: error: (Each undeclared identifier is reported only once 
   for each function it appears in.)
alistviewitem.cpp:31: error: `label1' undeclared (first use this function)
alistviewitem.cpp:31: error: `label2' undeclared (first use this function)
alistviewitem.cpp:31: error: `label3' undeclared (first use this function)
alistviewitem.cpp:31: error: `label4' undeclared (first use this function)
alistviewitem.cpp:31: error: `label5' undeclared (first use this function)
alistviewitem.cpp:31: error: `label6' undeclared (first use this function)
alistviewitem.cpp:31: error: `label7' undeclared (first use this function)
alistviewitem.cpp:31: error: `label8' undeclared (first use this function)
alistviewitem.cpp:33: error: `fileref' undeclared (first use this function)
alistviewitem.cpp: At global scope:
alistviewitem.cpp:38: error: invalid use of undefined type `class AListViewItem
   '
alistviewitem.h:21: error: forward declaration of `class AListViewItem'
alistviewitem.cpp:41: error: `QString' was not declared in this scope
alistviewitem.cpp:41: error: σφάλμα επεξεργασίας before `)' 
   token
alistviewitem.cpp:42: error: invalid use of undefined type `class AListViewItem
   '
alistviewitem.h:21: error: forward declaration of `class AListViewItem'
alistviewitem.cpp: In member function `void AListViewItem::FileRef(...)':
alistviewitem.cpp:43: error: `fname' undeclared (first use this function)
alistviewitem.cpp:43: error: `filename' undeclared (first use this function)
alistviewitem.cpp:44: error: `QFile' undeclared (first use this function)
alistviewitem.cpp:44: error: σφάλμα επεξεργασίας before `::' 
   token
alistviewitem.cpp: At global scope:
alistviewitem.cpp:76: error: invalid use of undefined type `class AListViewItem
   '
alistviewitem.h:21: error: forward declaration of `class AListViewItem'
alistviewitem.cpp: In member function `TagLib::Tag* AListViewItem::getTag()':
alistviewitem.cpp:85: error: `qDebug' undeclared (first use this function)
alistviewitem.cpp: At global scope:
alistviewitem.cpp:91: error: invalid use of undefined type `class AListViewItem
   '
alistviewitem.h:21: error: forward declaration of `class AListViewItem'
alistviewitem.cpp:96: error: invalid use of undefined type `class AListViewItem
   '
alistviewitem.h:21: error: forward declaration of `class AListViewItem'
alistviewitem.cpp:103: error: σφάλμα σύνταξης before `::' token
alistviewitem.cpp:109: error: invalid use of undefined type `class 
   AListViewItem'
alistviewitem.h:21: error: forward declaration of `class AListViewItem'
alistviewitem.cpp:114: error: invalid use of undefined type `class 
   AListViewItem'
alistviewitem.h:21: error: forward declaration of `class AListViewItem'
alistviewitem.cpp:119: error: invalid use of undefined type `class 
   AListViewItem'
alistviewitem.h:21: error: forward declaration of `class AListViewItem'
alistviewitem.cpp:124: error: invalid use of undefined type `class 
   AListViewItem'
alistviewitem.h:21: error: forward declaration of `class AListViewItem'
alistviewitem.cpp: In function `void 
   __static_initialization_and_destruction_0(int, int)':
alistviewitem.cpp:25: προειδοποίηση: statement with no effect
alistviewitem.cpp:26: προειδοποίηση: statement with no effect
alistviewitem.cpp:27: προειδοποίηση: statement with no effect
make[1]: *** [alistviewitem.o] Error 1
make: *** [sub-src] Error 2