gcc41 -I"/usr/home/visionary/work/ffmpeg"/libswscale -DHAVE_AV_CONFIG_H -D_FILE_OFFSET_BITS=64 -D_LARGEFILE_SOURCE -D_ISOC9X_SOURCE -I"/usr/home/visionary/work/ffmpeg" -I"/usr/home/visionary/work/ffmpeg" -I"/usr/home/visionary/work/ffmpeg"/libavutil -pthread -I/usr/local/include -fomit-frame-pointer -g -Wdeclaration-after-statement -Wall -Wno-switch -Wdisabled-optimization -Wpointer-arith -Wredundant-decls -Wno-pointer-sign -O3 -c -o jfdctfst.o jfdctfst.c
jfdctfst.c: In function 'row_fdct':
jfdctfst.c:149: error: 'int_fast16_t' undeclared (first use in this function)
jfdctfst.c:149: error: (Each undeclared identifier is reported only once
jfdctfst.c:149: error: for each function it appears in.)
jfdctfst.c:149: error: expected ';' before 'tmp0'
jfdctfst.c:150: error: expected ';' before 'tmp10'
jfdctfst.c:151: error: expected ';' before 'z1'
jfdctfst.c:152: warning: ISO C90 forbids mixed declarations and code
jfdctfst.c:160: error: 'tmp0' undeclared (first use in this function)
jfdctfst.c:161: error: 'tmp7' undeclared (first use in this function)
jfdctfst.c:162: error: 'tmp1' undeclared (first use in this function)
jfdctfst.c:163: error: 'tmp6' undeclared (first use in this function)
jfdctfst.c:164: error: 'tmp2' undeclared (first use in this function)
jfdctfst.c:165: error: 'tmp5' undeclared (first use in this function)
jfdctfst.c:166: error: 'tmp3' undeclared (first use in this function)
jfdctfst.c:167: error: 'tmp4' undeclared (first use in this function)
jfdctfst.c:171: error: 'tmp10' undeclared (first use in this function)
jfdctfst.c:172: error: 'tmp13' undeclared (first use in this function)
jfdctfst.c:173: error: 'tmp11' undeclared (first use in this function)
jfdctfst.c:174: error: 'tmp12' undeclared (first use in this function)
jfdctfst.c:179: error: 'z1' undeclared (first use in this function)
jfdctfst.c:190: error: 'z5' undeclared (first use in this function)
jfdctfst.c:191: error: 'z2' undeclared (first use in this function)
jfdctfst.c:192: error: 'z4' undeclared (first use in this function)
jfdctfst.c:193: error: 'z3' undeclared (first use in this function)
jfdctfst.c:195: error: 'z11' undeclared (first use in this function)
jfdctfst.c:196: error: 'z13' undeclared (first use in this function)
jfdctfst.c: In function 'fdct_ifast':
jfdctfst.c:214: error: 'int_fast16_t' undeclared (first use in this function)
jfdctfst.c:214: error: expected ';' before 'tmp0'
jfdctfst.c:215: error: expected ';' before 'tmp10'
jfdctfst.c:216: error: expected ';' before 'z1'
jfdctfst.c:217: warning: ISO C90 forbids mixed declarations and code
jfdctfst.c:227: error: 'tmp0' undeclared (first use in this function)
jfdctfst.c:228: error: 'tmp7' undeclared (first use in this function)
jfdctfst.c:229: error: 'tmp1' undeclared (first use in this function)
jfdctfst.c:230: error: 'tmp6' undeclared (first use in this function)
jfdctfst.c:231: error: 'tmp2' undeclared (first use in this function)
jfdctfst.c:232: error: 'tmp5' undeclared (first use in this function)
jfdctfst.c:233: error: 'tmp3' undeclared (first use in this function)
jfdctfst.c:234: error: 'tmp4' undeclared (first use in this function)
jfdctfst.c:238: error: 'tmp10' undeclared (first use in this function)
jfdctfst.c:239: error: 'tmp13' undeclared (first use in this function)
jfdctfst.c:240: error: 'tmp11' undeclared (first use in this function)
jfdctfst.c:241: error: 'tmp12' undeclared (first use in this function)
jfdctfst.c:246: error: 'z1' undeclared (first use in this function)
jfdctfst.c:257: error: 'z5' undeclared (first use in this function)
jfdctfst.c:258: error: 'z2' undeclared (first use in this function)
jfdctfst.c:259: error: 'z4' undeclared (first use in this function)
jfdctfst.c:260: error: 'z3' undeclared (first use in this function)
jfdctfst.c:262: error: 'z11' undeclared (first use in this function)
jfdctfst.c:263: error: 'z13' undeclared (first use in this function)
jfdctfst.c: In function 'fdct_ifast248':
jfdctfst.c:281: error: 'int_fast16_t' undeclared (first use in this function)
jfdctfst.c:281: error: expected ';' before 'tmp0'
jfdctfst.c:282: error: expected ';' before 'tmp10'
jfdctfst.c:283: error: expected ';' before 'z1'
jfdctfst.c:284: warning: ISO C90 forbids mixed declarations and code
jfdctfst.c:294: error: 'tmp0' undeclared (first use in this function)
jfdctfst.c:295: error: 'tmp1' undeclared (first use in this function)
jfdctfst.c:296: error: 'tmp2' undeclared (first use in this function)
jfdctfst.c:297: error: 'tmp3' undeclared (first use in this function)
jfdctfst.c:298: error: 'tmp4' undeclared (first use in this function)
jfdctfst.c:299: error: 'tmp5' undeclared (first use in this function)
jfdctfst.c:300: error: 'tmp6' undeclared (first use in this function)
jfdctfst.c:301: error: 'tmp7' undeclared (first use in this function)
jfdctfst.c:305: error: 'tmp10' undeclared (first use in this function)
jfdctfst.c:306: error: 'tmp11' undeclared (first use in this function)
jfdctfst.c:307: error: 'tmp12' undeclared (first use in this function)
jfdctfst.c:308: error: 'tmp13' undeclared (first use in this function)
jfdctfst.c:313: error: 'z1' undeclared (first use in this function)
gmake[1]: *** [jfdctfst.o] Error 1
gmake[1]: Leaving directory `/usr/home/visionary/work/ffmpeg/libavcodec'
gmake: *** [lib] Error 2
[root@visionary /usr/home/visionary/work/ffmpeg]#