CC [M] /var/tmp/portage/x11-base/x11-drm-20060608-r1/work/drm/linux-core/drm_auth.o
CC [M] /var/tmp/portage/x11-base/x11-drm-20060608-r1/work/drm/linux-core/drm_bufs.o
CC [M] /var/tmp/portage/x11-base/x11-drm-20060608-r1/work/drm/linux-core/drm_context.o
CC [M] /var/tmp/portage/x11-base/x11-drm-20060608-r1/work/drm/linux-core/drm_dma.o
CC [M] /var/tmp/portage/x11-base/x11-drm-20060608-r1/work/drm/linux-core/drm_drawable.o
CC [M] /var/tmp/portage/x11-base/x11-drm-20060608-r1/work/drm/linux-core/drm_drv.o
/var/tmp/portage/x11-base/x11-drm-20060608-r1/work/drm/linux-core/drm_drv.c: In function 'drm_init':
/var/tmp/portage/x11-base/x11-drm-20060608-r1/work/drm/linux-core/drm_drv.c:304: warning: ignoring return value of 'pci_register_driver', declared with attribute warn_unused_result
CC [M] /var/tmp/portage/x11-base/x11-drm-20060608-r1/work/drm/linux-core/drm_fops.o
/var/tmp/portage/x11-base/x11-drm-20060608-r1/work/drm/linux-core/drm_fops.c: In function 'drm_stub_open':
/var/tmp/portage/x11-base/x11-drm-20060608-r1/work/drm/linux-core/drm_fops.c:189: warning: assignment discards qualifiers from pointer target type
CC [M] /var/tmp/portage/x11-base/x11-drm-20060608-r1/work/drm/linux-core/drm_ioctl.o
CC [M] /var/tmp/portage/x11-base/x11-drm-20060608-r1/work/drm/linux-core/drm_irq.o
/var/tmp/portage/x11-base/x11-drm-20060608-r1/work/drm/linux-core/drm_irq.c: In function 'drm_irq_install':
/var/tmp/portage/x11-base/x11-drm-20060608-r1/work/drm/linux-core/drm_irq.c:135: warning: passing argument 2 of 'request_irq' from incompatible pointer type
CC [M] /var/tmp/portage/x11-base/x11-drm-20060608-r1/work/drm/linux-core/drm_lock.o
CC [M] /var/tmp/portage/x11-base/x11-drm-20060608-r1/work/drm/linux-core/drm_memory.o
CC [M] /var/tmp/portage/x11-base/x11-drm-20060608-r1/work/drm/linux-core/drm_proc.o
CC [M] /var/tmp/portage/x11-base/x11-drm-20060608-r1/work/drm/linux-core/drm_stub.o
/var/tmp/portage/x11-base/x11-drm-20060608-r1/work/drm/linux-core/drm_stub.c:51: error: size of array 'type name' is negative
/var/tmp/portage/x11-base/x11-drm-20060608-r1/work/drm/linux-core/drm_stub.c: In function 'drm_get_dev':
/var/tmp/portage/x11-base/x11-drm-20060608-r1/work/drm/linux-core/drm_stub.c:216: warning: ignoring return value of 'pci_request_regions', declared with attribute warn_unused_result
/var/tmp/portage/x11-base/x11-drm-20060608-r1/work/drm/linux-core/drm_stub.c:219: warning: ignoring return value of 'pci_enable_device', declared with attribute warn_unused_result
make[2]: *** [/var/tmp/portage/x11-base/x11-drm-20060608-r1/work/drm/linux-core/drm_stub.o] Error 1
make[1]: *** [_module_/var/tmp/portage/x11-base/x11-drm-20060608-r1/work/drm/linux-core] Error 2
make[1]: Leaving directory `/usr/src/linux-2.6.20-nicus1'
make: *** [modules] Error 2
* Portage could not build the DRM modules. If you see an ACCESS DENIED error,
* this could mean that you were using an unsupported kernel build system. All
* 2.4 kernels are supported, but only 2.6 kernels at least as new as 2.6.6
* are supported.
!!! ERROR: x11-base/x11-drm-20060608-r1 failed.
Call stack:
ebuild.sh, line 1614: Called dyn_compile
ebuild.sh, line 971: Called qa_call 'src_compile'
environment, line 4138: Called src_compile
x11-drm-20060608-r1.ebuild, line 94: Called src_compile_os
x11-drm-20060608-r1.ebuild, line 249: Called src_compile_linux
x11-drm-20060608-r1.ebuild, line 273: Called die_error
x11-drm-20060608-r1.ebuild, line 314: Called die
!!! Unable to build DRM modules.
!!! If you need support, post the topmost build error, and the call stack if relevant.
!!! A complete build log is located at '/var/tmp/portage/x11-base/x11-drm-20060608-r1/temp/build.log'