make install
[===== NOW BUILDING: kde-1 =====]
[fetch] complete for kde.
[checksum] complete for kde.
[extract] complete for kde.
[patch] complete for kde.
==> Building kde/kdebase as a dependency
make[1]: Entering directory `/home/kdedummy/konstruct/kde/kdebase'
[===== NOW BUILDING: kdebase-3.5.6 =====]
[fetch] complete for kdebase.
[checksum] complete for kdebase.
[extract] complete for kdebase.
[patch] complete for kdebase.
==> Building kde/kdelibs as a dependency
make[2]: Entering directory `/home/kdedummy/konstruct/kde/kdelibs'
[===== NOW BUILDING: kdelibs-3.5.6 =====]
[fetch] complete for kdelibs.
[checksum] complete for kdelibs.
[extract] complete for kdelibs.
[patch] complete for kdelibs.
==> Building libs/arts as a dependency
make[3]: Entering directory `/home/kdedummy/konstruct/libs/arts'
[===== NOW BUILDING: arts-1.5.6 =====]
[fetch] complete for arts.
[checksum] complete for arts.
[extract] complete for arts.
[patch] complete for arts.
==> Building libs/glib as a dependency
==> Building libs/qt-x11-free as a dependency
make[4]: Entering directory `/home/kdedummy/konstruct/libs/qt-x11-free'
[===== NOW BUILDING: qt-x11-free-3.3.7 =====]
[fetch] complete for qt-x11-free.
[checksum] complete for qt-x11-free.
[extract] complete for qt-x11-free.
[patch] complete for qt-x11-free.
[configure] complete for qt-x11-free.
==> Running make in work/qt-x11-free-3.3.7
make[5]: Entering directory `/home/kdedummy/konstruct/libs/qt-x11-free/work/qt-x11-free-3.3.7'
cd qmake && make
make[6]: Entering directory `/home/kdedummy/konstruct/libs/qt-x11-free/work/qt-x11-free-3.3.7/qmake'
make[6]: `qmake' is up to date.
make[6]: Leaving directory `/home/kdedummy/konstruct/libs/qt-x11-free/work/qt-x11-free-3.3.7/qmake'
cd src/moc && make
make[6]: Entering directory `/home/kdedummy/konstruct/libs/qt-x11-free/work/qt-x11-free-3.3.7/src/moc'
make[6]: Nothing to be done for `first'.
make[6]: Leaving directory `/home/kdedummy/konstruct/libs/qt-x11-free/work/qt-x11-free-3.3.7/src/moc'
cd src && make
make[6]: Entering directory `/home/kdedummy/konstruct/libs/qt-x11-free/work/qt-x11-free-3.3.7/src'
g++ -c -pipe -fno-exceptions -Wall -W -O2 -pipe -D_REENTRANT -fPIC -DQT_SHARED -DQT_NO_DEBUG -DQT_THREAD_SUPPORT -DQT_THREAD_SUPPORT -DQT_NO_CUPS -D_LARGEFILE_SOURCE -D_LARGE_FILES -D_FILE_OFFSET_BITS=64 -DQT_NO_IMAGEIO_MNG -DQT_NO_IMAGEIO_JPEG -DQT_BUILTIN_GIF_READER=1 -DQT_NO_STYLE_MAC -DQT_NO_STYLE_AQUA -DQT_NO_STYLE_INTERLACE -DQT_NO_STYLE_WINDOWSXP -DQT_NO_STYLE_COMPACT -DQT_NO_STYLE_POCKETPC -I/home/kdedummy/konstruct/libs/qt-x11-free/work/qt-x11-free-3.3.7/mkspecs/linux-g++ -I. -I/usr/include/freetype2 -I3rdparty/opentype -I../include -I/usr/X11R6/include -I.moc/release-shared-mt/ -o .obj/release-shared-mt/qpngio.o kernel/qpngio.cpp
kernel/qpngio.cpp:45:17: error: png.h: No such file or directory
kernel/qpngio.cpp:67: error: variable or field iod_read_fn declared void
kernel/qpngio.cpp:67: error: png_structp was not declared in this scope
kernel/qpngio.cpp:67: error: png_bytep was not declared in this scope
kernel/qpngio.cpp:67: error: png_size_t was not declared in this scope
kernel/qpngio.cpp:67: error: initializer expression list treated as compound expression
kernel/qpngio.cpp:68: error: expected , or ; before { token
kernel/qpngio.cpp:84: error: variable or field qpiw_write_fn declared void
kernel/qpngio.cpp:84: error: png_structp was not declared in this scope
kernel/qpngio.cpp:84: error: png_bytep was not declared in this scope
kernel/qpngio.cpp:84: error: png_size_t was not declared in this scope
kernel/qpngio.cpp:84: error: initializer expression list treated as compound expression
kernel/qpngio.cpp:85: error: expected , or ; before { token
kernel/qpngio.cpp:98: error: variable or field qpiw_flush_fn declared void
kernel/qpngio.cpp:98: error: png_structp was not declared in this scope
kernel/qpngio.cpp:99: error: expected , or ; before { token
kernel/qpngio.cpp:111: error: png_structp has not been declared
kernel/qpngio.cpp:111: error: png_infop has not been declared
kernel/qpngio.cpp: In function void setup_qt(QImage&, int, int, float):
kernel/qpngio.cpp:113: error: PNG_INFO_gAMA was not declared in this scope
kernel/qpngio.cpp:113: error: png_get_valid was not declared in this scope
kernel/qpngio.cpp:115: error: png_get_gAMA was not declared in this scope
kernel/qpngio.cpp:116: error: png_set_gamma was not declared in this scope
kernel/qpngio.cpp:119: error: png_uint_32 was not declared in this scope
kernel/qpngio.cpp:119: error: expected `;' before width
kernel/qpngio.cpp:120: error: expected `;' before height
kernel/qpngio.cpp:123: error: width was not declared in this scope
kernel/qpngio.cpp:123: error: height was not declared in this scope
kernel/qpngio.cpp:124: error: png_get_IHDR was not declared in this scope
kernel/qpngio.cpp:126: error: PNG_COLOR_TYPE_GRAY was not declared in this scope
kernel/qpngio.cpp:128: error: base operand of -> is not a pointer
kernel/qpngio.cpp:129: error: png_set_invert_mono was not declared in this scope
kernel/qpngio.cpp:130: error: png_read_update_info was not declared in this scope
kernel/qpngio.cpp:135: error: PNG_INFO_tRNS was not declared in this scope
kernel/qpngio.cpp:135: error: png_get_valid was not declared in this scope
kernel/qpngio.cpp:136: error: png_set_expand was not declared in this scope
kernel/qpngio.cpp:137: error: png_set_strip_16 was not declared in this scope
kernel/qpngio.cpp:138: error: png_set_gray_to_rgb was not declared in this scope
kernel/qpngio.cpp:145: error: png_set_swap_alpha was not declared in this scope
kernel/qpngio.cpp:147: error: png_read_update_info was not declared in this scope
kernel/qpngio.cpp:150: error: png_set_strip_16 was not declared in this scope
kernel/qpngio.cpp:152: error: png_set_packing was not declared in this scope
kernel/qpngio.cpp:154: error: png_read_update_info was not declared in this scope
kernel/qpngio.cpp:162: error: base operand of -> is not a pointer
kernel/qpngio.cpp:169: error: PNG_COLOR_TYPE_PALETTE was not declared in this scope
kernel/qpngio.cpp:170: error: PNG_INFO_PLTE was not declared in this scope
kernel/qpngio.cpp:170: error: png_get_valid was not declared in this scope
kernel/qpngio.cpp:171: error: base operand of -> is not a pointer
kernel/qpngio.cpp:175: error: png_set_packing was not declared in this scope
kernel/qpngio.cpp:176: error: png_read_update_info was not declared in this scope
kernel/qpngio.cpp:179: error: base operand of -> is not a pointer
kernel/qpngio.cpp:183: error: PNG_INFO_tRNS was not declared in this scope
kernel/qpngio.cpp:185: error: base operand of -> is not a pointer
kernel/qpngio.cpp:187: error: base operand of -> is not a pointer
kernel/qpngio.cpp:188: error: base operand of -> is not a pointer
kernel/qpngio.cpp:189: error: base operand of -> is not a pointer
kernel/qpngio.cpp:190: error: base operand of -> is not a pointer
kernel/qpngio.cpp:196: error: base operand of -> is not a pointer
kernel/qpngio.cpp:198: error: base operand of -> is not a pointer
kernel/qpngio.cpp:199: error: base operand of -> is not a pointer
kernel/qpngio.cpp:200: error: base operand of -> is not a pointer
kernel/qpngio.cpp:209: error: png_set_strip_16 was not declared in this scope
kernel/qpngio.cpp:211: error: png_set_expand was not declared in this scope
kernel/qpngio.cpp:213: error: PNG_COLOR_TYPE_GRAY_ALPHA was not declared in this scope
kernel/qpngio.cpp:214: error: png_set_gray_to_rgb was not declared in this scope
kernel/qpngio.cpp:220: error: PNG_COLOR_MASK_ALPHA was not declared in this scope
kernel/qpngio.cpp:221: error: PNG_INFO_tRNS was not declared in this scope
kernel/qpngio.cpp:224: error: PNG_FILLER_BEFORE was not declared in this scope
kernel/qpngio.cpp:224: error: PNG_FILLER_AFTER was not declared in this scope
kernel/qpngio.cpp:224: error: png_set_filler was not declared in this scope
kernel/qpngio.cpp:231: error: png_set_swap_alpha was not declared in this scope
kernel/qpngio.cpp:234: error: png_read_update_info was not declared in this scope
kernel/qpngio.cpp:239: error: png_set_bgr was not declared in this scope
kernel/qpngio.cpp: At global scope:
kernel/qpngio.cpp:247: error: variable or field qt_png_warning declared void
kernel/qpngio.cpp:247: error: png_structp was not declared in this scope
kernel/qpngio.cpp:247: error: png_const_charp was not declared in this scope
kernel/qpngio.cpp:247: error: initializer expression list treated as compound expression
kernel/qpngio.cpp:248: error: expected , or ; before { token
kernel/qpngio.cpp: In function void read_png_image(QImageIO*):
kernel/qpngio.cpp:260: error: png_structp was not declared in this scope
kernel/qpngio.cpp:260: error: expected `;' before png_ptr
kernel/qpngio.cpp:261: error: png_infop was not declared in this scope
kernel/qpngio.cpp:261: error: expected `;' before info_ptr
kernel/qpngio.cpp:262: error: expected `;' before end_info
kernel/qpngio.cpp:263: error: png_bytep was not declared in this scope
kernel/qpngio.cpp:263: error: row_pointers was not declared in this scope
kernel/qpngio.cpp:265: error: png_ptr was not declared in this scope
kernel/qpngio.cpp:265: error: PNG_LIBPNG_VER_STRING was not declared in this scope
kernel/qpngio.cpp:265: error: png_create_read_struct was not declared in this scope
kernel/qpngio.cpp:271: error: png_set_error_fn was not declared in this scope
kernel/qpngio.cpp:273: error: info_ptr was not declared in this scope
kernel/qpngio.cpp:273: error: png_create_info_struct was not declared in this scope
kernel/qpngio.cpp:275: error: png_destroy_read_struct was not declared in this scope
kernel/qpngio.cpp:280: error: end_info was not declared in this scope
kernel/qpngio.cpp:282: error: png_destroy_read_struct was not declared in this scope
kernel/qpngio.cpp:287: error: setjmp was not declared in this scope
kernel/qpngio.cpp:288: error: png_destroy_read_struct was not declared in this scope
kernel/qpngio.cpp:293: error: png_set_read_fn was not declared in this scope
kernel/qpngio.cpp:294: error: png_read_info was not declared in this scope
kernel/qpngio.cpp:299: error: png_destroy_read_struct was not declared in this scope
kernel/qpngio.cpp:304: error: png_uint_32 was not declared in this scope
kernel/qpngio.cpp:304: error: expected `;' before width
kernel/qpngio.cpp:305: error: expected `;' before height
kernel/qpngio.cpp:308: error: width was not declared in this scope
kernel/qpngio.cpp:308: error: height was not declared in this scope
kernel/qpngio.cpp:309: error: png_get_IHDR was not declared in this scope
kernel/qpngio.cpp:312: error: expected type-specifier before png_bytep
kernel/qpngio.cpp:312: error: expected `;' before png_bytep
kernel/qpngio.cpp:318: error: png_read_image was not declared in this scope
kernel/qpngio.cpp:338: error: png_get_x_pixels_per_meter was not declared in this scope
kernel/qpngio.cpp:339: error: png_get_y_pixels_per_meter was not declared in this scope
kernel/qpngio.cpp:342: error: png_textp was not declared in this scope
kernel/qpngio.cpp:342: error: expected `;' before text_ptr
kernel/qpngio.cpp:344: error: text_ptr was not declared in this scope
kernel/qpngio.cpp:344: error: png_get_text was not declared in this scope
kernel/qpngio.cpp:351: error: type <type error> argument given to delete, expected pointer
kernel/qpngio.cpp:373: error: png_read_end was not declared in this scope
kernel/qpngio.cpp:374: error: png_destroy_read_struct was not declared in this scope
kernel/qpngio.cpp: At global scope:
kernel/qpngio.cpp:415: error: png_structp has not been declared
kernel/qpngio.cpp:415: error: png_infop has not been declared
kernel/qpngio.cpp: In function void set_text(const QImage&, int, int, bool):
kernel/qpngio.cpp:419: error: png_textp was not declared in this scope
kernel/qpngio.cpp:419: error: expected `;' before text_ptr
kernel/qpngio.cpp:427: error: text_ptr was not declared in this scope
kernel/qpngio.cpp:427: error: PNG_TEXT_COMPRESSION_NONE was not declared in this scope
kernel/qpngio.cpp:429: error: text_ptr was not declared in this scope
kernel/qpngio.cpp:429: error: PNG_TEXT_COMPRESSION_zTXt was not declared in this scope
kernel/qpngio.cpp:430: error: text_ptr was not declared in this scope
kernel/qpngio.cpp:430: error: png_charp was not declared in this scope
kernel/qpngio.cpp:431: error: expected `;' before t
kernel/qpngio.cpp:436: error: text_ptr was not declared in this scope
kernel/qpngio.cpp:436: error: png_set_text was not declared in this scope
kernel/qpngio.cpp:439: error: type <type error> argument given to delete, expected pointer
kernel/qpngio.cpp: In member function bool QPNGImageWriter::writeImage(const QImage&, int, int, int):
kernel/qpngio.cpp:455: error: png_structp was not declared in this scope
kernel/qpngio.cpp:455: error: expected `;' before png_ptr
kernel/qpngio.cpp:456: error: png_infop was not declared in this scope
kernel/qpngio.cpp:456: error: expected `;' before info_ptr
kernel/qpngio.cpp:457: error: png_bytep was not declared in this scope
kernel/qpngio.cpp:457: error: row_pointers was not declared in this scope
kernel/qpngio.cpp:459: error: png_ptr was not declared in this scope
kernel/qpngio.cpp:459: error: PNG_LIBPNG_VER_STRING was not declared in this scope
kernel/qpngio.cpp:459: error: png_create_write_struct was not declared in this scope
kernel/qpngio.cpp:464: error: png_set_error_fn was not declared in this scope
kernel/qpngio.cpp:466: error: info_ptr was not declared in this scope
kernel/qpngio.cpp:466: error: png_create_info_struct was not declared in this scope
kernel/qpngio.cpp:468: error: png_destroy_write_struct was not declared in this scope
kernel/qpngio.cpp:472: error: setjmp was not declared in this scope
kernel/qpngio.cpp:473: error: png_destroy_write_struct was not declared in this scope
kernel/qpngio.cpp:485: error: png_set_compression_level was not declared in this scope
kernel/qpngio.cpp:489: error: png_set_gAMA was not declared in this scope
kernel/qpngio.cpp:492: error: png_set_write_fn was not declared in this scope
kernel/qpngio.cpp:503: error: PNG_COLOR_TYPE_RGB_ALPHA was not declared in this scope
kernel/qpngio.cpp:504: error: PNG_COLOR_TYPE_RGB was not declared in this scope
kernel/qpngio.cpp:505: error: PNG_COLOR_TYPE_PALETTE was not declared in this scope
kernel/qpngio.cpp:505: error: png_set_IHDR was not declared in this scope
kernel/qpngio.cpp:514: error: png_set_packswap was not declared in this scope
kernel/qpngio.cpp:516: error: png_colorp was not declared in this scope
kernel/qpngio.cpp:516: error: expected `;' before palette
kernel/qpngio.cpp:517: error: expected `;' before copy_trans
kernel/qpngio.cpp:521: error: palette was not declared in this scope
kernel/qpngio.cpp:521: error: expected type-specifier before png_color
kernel/qpngio.cpp:521: error: expected `;' before png_color
kernel/qpngio.cpp:522: error: png_set_PLTE was not declared in this scope
kernel/qpngio.cpp:538: error: copy_trans was not declared in this scope
kernel/qpngio.cpp:538: error: expected type-specifier before png_byte
kernel/qpngio.cpp:538: error: expected `;' before png_byte
kernel/qpngio.cpp:541: error: png_set_tRNS was not declared in this scope
kernel/qpngio.cpp:553: error: png_set_swap_alpha was not declared in this scope
kernel/qpngio.cpp:558: error: png_set_bgr was not declared in this scope
kernel/qpngio.cpp:562: error: PNG_OFFSET_PIXEL was not declared in this scope
kernel/qpngio.cpp:562: error: png_set_oFFs was not declared in this scope
kernel/qpngio.cpp:566: error: png_set_sig_bytes was not declared in this scope
kernel/qpngio.cpp:571: error: PNG_RESOLUTION_METER was not declared in this scope
kernel/qpngio.cpp:571: error: png_set_pHYs was not declared in this scope
kernel/qpngio.cpp:579: error: png_write_info was not declared in this scope
kernel/qpngio.cpp:587: error: png_set_packing was not declared in this scope
kernel/qpngio.cpp:592: error: PNG_FILLER_BEFORE was not declared in this scope
kernel/qpngio.cpp:592: error: PNG_FILLER_AFTER was not declared in this scope
kernel/qpngio.cpp:592: error: png_set_filler was not declared in this scope
kernel/qpngio.cpp:599: error: png_byte was not declared in this scope
kernel/qpngio.cpp:599: error: expected primary-expression before ) token
kernel/qpngio.cpp:599: error: png_write_chunk was not declared in this scope
kernel/qpngio.cpp:607: error: png_byte was not declared in this scope
kernel/qpngio.cpp:607: error: expected primary-expression before ) token
kernel/qpngio.cpp:607: error: png_write_chunk was not declared in this scope
kernel/qpngio.cpp:610: error: png_uint_32 was not declared in this scope
kernel/qpngio.cpp:610: error: expected `;' before width
kernel/qpngio.cpp:611: error: expected `;' before height
kernel/qpngio.cpp:614: error: width was not declared in this scope
kernel/qpngio.cpp:614: error: height was not declared in this scope
kernel/qpngio.cpp:615: error: png_get_IHDR was not declared in this scope
kernel/qpngio.cpp:618: error: expected type-specifier before png_bytep
kernel/qpngio.cpp:618: error: expected `;' before png_bytep
kernel/qpngio.cpp:623: error: png_write_image was not declared in this scope
kernel/qpngio.cpp:624: error: type <type error> argument given to delete, expected pointer
kernel/qpngio.cpp:626: error: png_write_end was not declared in this scope
kernel/qpngio.cpp:629: error: palette was not declared in this scope
kernel/qpngio.cpp:630: error: type <type error> argument given to delete, expected pointer
kernel/qpngio.cpp:631: error: copy_trans was not declared in this scope
kernel/qpngio.cpp:632: error: type <type error> argument given to delete, expected pointer
kernel/qpngio.cpp:634: error: png_destroy_write_struct was not declared in this scope
kernel/qpngio.cpp: At global scope:
kernel/qpngio.cpp:835: error: png_structp has not been declared
kernel/qpngio.cpp:835: error: png_infop has not been declared
kernel/qpngio.cpp:836: error: png_structp has not been declared
kernel/qpngio.cpp:836: error: png_bytep has not been declared
kernel/qpngio.cpp:837: error: png_uint_32 has not been declared
kernel/qpngio.cpp:838: error: png_structp has not been declared
kernel/qpngio.cpp:838: error: png_infop has not been declared
kernel/qpngio.cpp:852: error: png_structp does not name a type
kernel/qpngio.cpp:853: error: png_infop does not name a type
kernel/qpngio.cpp:942: error: variable or field info_callback declared void
kernel/qpngio.cpp:942: error: png_structp was not declared in this scope
kernel/qpngio.cpp:942: error: png_infop was not declared in this scope
kernel/qpngio.cpp:942: error: initializer expression list treated as compound expression
kernel/qpngio.cpp:943: error: expected , or ; before { token
kernel/qpngio.cpp:949: error: variable or field row_callback declared void
kernel/qpngio.cpp:949: error: png_structp was not declared in this scope
kernel/qpngio.cpp:949: error: png_bytep was not declared in this scope
kernel/qpngio.cpp:950: error: png_uint_32 was not declared in this scope
kernel/qpngio.cpp:950: error: expected primary-expression before int
kernel/qpngio.cpp:950: error: initializer expression list treated as compound expression
kernel/qpngio.cpp:951: error: expected , or ; before { token
kernel/qpngio.cpp:957: error: variable or field end_callback declared void
kernel/qpngio.cpp:957: error: png_structp was not declared in this scope
kernel/qpngio.cpp:957: error: png_infop was not declared in this scope
kernel/qpngio.cpp:957: error: initializer expression list treated as compound expression
kernel/qpngio.cpp:958: error: expected , or ; before { token
kernel/qpngio.cpp: In constructor QPNGFormat::QPNGFormat():
kernel/qpngio.cpp:989: error: png_ptr was not declared in this scope
kernel/qpngio.cpp:990: error: info_ptr was not declared in this scope
kernel/qpngio.cpp: In destructor virtual QPNGFormat::~QPNGFormat():
kernel/qpngio.cpp:999: error: png_ptr was not declared in this scope
kernel/qpngio.cpp:1000: error: info_ptr was not declared in this scope
kernel/qpngio.cpp:1000: error: png_destroy_read_struct was not declared in this scope
kernel/qpngio.cpp: In member function virtual int QPNGFormat::decode(QImage&, QImageConsumer*, const uchar*, int):
kernel/qpngio.cpp:1016: error: png_ptr was not declared in this scope
kernel/qpngio.cpp:1016: error: PNG_LIBPNG_VER_STRING was not declared in this scope
kernel/qpngio.cpp:1016: error: png_create_read_struct was not declared in this scope
kernel/qpngio.cpp:1018: error: info_ptr was not declared in this scope
kernel/qpngio.cpp:1023: error: png_set_error_fn was not declared in this scope
kernel/qpngio.cpp:1024: error: png_set_compression_level was not declared in this scope
kernel/qpngio.cpp:1026: error: info_ptr was not declared in this scope
kernel/qpngio.cpp:1026: error: png_create_info_struct was not declared in this scope
kernel/qpngio.cpp:1028: error: png_destroy_read_struct was not declared in this scope
kernel/qpngio.cpp:1033: error: setjmp was not declared in this scope
kernel/qpngio.cpp:1034: error: png_destroy_read_struct was not declared in this scope
kernel/qpngio.cpp:1040: error: png_set_progressive_read_fn was not declared in this scope
kernel/qpngio.cpp:1052: error: png_set_sig_bytes was not declared in this scope
kernel/qpngio.cpp:1058: error: png_ptr was not declared in this scope
kernel/qpngio.cpp:1060: error: png_ptr was not declared in this scope
kernel/qpngio.cpp:1060: error: setjmp was not declared in this scope
kernel/qpngio.cpp:1061: error: info_ptr was not declared in this scope
kernel/qpngio.cpp:1061: error: png_destroy_read_struct was not declared in this scope
kernel/qpngio.cpp:1067: error: png_ptr was not declared in this scope
kernel/qpngio.cpp:1067: error: info_ptr was not declared in this scope
kernel/qpngio.cpp:1067: error: png_bytep was not declared in this scope
kernel/qpngio.cpp:1067: error: png_process_data was not declared in this scope
kernel/qpngio.cpp:1074: error: png_destroy_read_struct was not declared in this scope
kernel/qpngio.cpp: At global scope:
kernel/qpngio.cpp:1081: error: variable or field info declared void
kernel/qpngio.cpp:1081: error: int QPNGFormat::info is not a static member of class QPNGFormat
kernel/qpngio.cpp:1081: error: png_structp was not declared in this scope
kernel/qpngio.cpp:1081: error: png_infop was not declared in this scope
kernel/qpngio.cpp:1081: error: initializer expression list treated as compound expression
kernel/qpngio.cpp:1082: error: expected , or ; before { token
kernel/qpngio.cpp:1087: error: variable or field row declared void
kernel/qpngio.cpp:1087: error: int QPNGFormat::row is not a static member of class QPNGFormat
kernel/qpngio.cpp:1087: error: png_structp was not declared in this scope
kernel/qpngio.cpp:1087: error: png_bytep was not declared in this scope
kernel/qpngio.cpp:1088: error: png_uint_32 was not declared in this scope
kernel/qpngio.cpp:1088: error: expected primary-expression before int
kernel/qpngio.cpp:1088: error: initializer expression list treated as compound expression
kernel/qpngio.cpp:1089: error: expected , or ; before { token
kernel/qpngio.cpp:1095: error: variable or field end declared void
kernel/qpngio.cpp:1095: error: int QPNGFormat::end is not a static member of class QPNGFormat
kernel/qpngio.cpp:1095: error: png_structp was not declared in this scope
kernel/qpngio.cpp:1095: error: png_infop was not declared in this scope
kernel/qpngio.cpp:1095: error: initializer expression list treated as compound expression
kernel/qpngio.cpp:1096: error: expected , or ; before { token
kernel/qpngio.cpp: In function void qt_zlib_compression_hack():
kernel/qpngio.cpp:1235: error: compress was not declared in this scope
kernel/qpngio.cpp:1236: error: uncompress was not declared in this scope
make[6]: *** [.obj/release-shared-mt/qpngio.o] Error 1
make[6]: Leaving directory `/home/kdedummy/konstruct/libs/qt-x11-free/work/qt-x11-free-3.3.7/src'
make[5]: *** [sub-src] Error 2
make[5]: Leaving directory `/home/kdedummy/konstruct/libs/qt-x11-free/work/qt-x11-free-3.3.7'
make[4]: *** [build-work/qt-x11-free-3.3.7/Makefile] Error 2
make[4]: Leaving directory `/home/kdedummy/konstruct/libs/qt-x11-free'
make[3]: *** [dep-../../libs/qt-x11-free] Error 2
make[3]: Leaving directory `/home/kdedummy/konstruct/libs/arts'
make[2]: *** [dep-../../libs/arts] Error 2
make[2]: Leaving directory `/home/kdedummy/konstruct/kde/kdelibs'
make[1]: *** [dep-../../kde/kdelibs] Error 2
make[1]: Leaving directory `/home/kdedummy/konstruct/kde/kdebase'
make: *** [dep-../../kde/kdebase] Error 2