rendered paste bodymake[1]: Entering directory `/home/mfrisch/.WineCVS/sources/cvscedega/winex/libs/wpp'
gcc -MMD -c -I. -I. -I../../include -I../../include -g -O2 -Wall -fno-keep-static-consts -D__const=const -fno-strict-aliasing -Wa,--execstack -D__int8=char -D__int16=short -D__int32=int "-D__int64=long long" -D_REENTRANT -o preproc.o preproc.c
gcc -MMD -c -I. -I. -I../../include -I../../include -g -O2 -Wall -fno-keep-static-consts -D__const=const -fno-strict-aliasing -Wa,--execstack -D__int8=char -D__int16=short -D__int32=int "-D__int64=long long" -D_REENTRANT -o wpp.o wpp.c
bison -y -ppp -d -t ./ppy.y -o ppy.tab.c
gcc -MMD -c -I. -I. -I../../include -I../../include -g -O2 -Wall -fno-keep-static-consts -D__const=const -fno-strict-aliasing -Wa,--execstack -D__int8=char -D__int16=short -D__int32=int "-D__int64=long long" -D_REENTRANT -o ppy.tab.o ppy.tab.c
flex -olex.yy.c ./ppl.l
gcc -MMD -c -I. -I. -I../../include -I../../include -g -O2 -Wall -fno-keep-static-consts -D__const=const -fno-strict-aliasing -Wa,--execstack -D__int8=char -D__int16=short -D__int32=int "-D__int64=long long" -D_REENTRANT -o lex.yy.o lex.yy.c
rm -f libwpp.a
ar rc libwpp.a preproc.o wpp.o ppy.tab.o lex.yy.o
ranlib libwpp.a
make[1]: Leaving directory `/home/mfrisch/.WineCVS/sources/cvscedega/winex/libs/wpp'
make[1]: Entering directory `/home/mfrisch/.WineCVS/sources/cvscedega/winex/port'
gcc -MMD -c -I. -I. -I../include -I../include -g -O2 -Wall -fno-keep-static-consts -D__const=const -fno-strict-aliasing -Wa,--execstack -D__int8=char -D__int16=short -D__int32=int "-D__int64=long long" -fPIC -D__WINE__ -D_REENTRANT -o port.o port.c
port.c: In function ‘wine_gettid’:
port.c:622: warning: unused variable ‘ret’
gcc -MMD -c -I. -I. -I../include -I../include -g -O2 -Wall -fno-keep-static-consts -D__const=const -fno-strict-aliasing -Wa,--execstack -D__int8=char -D__int16=short -D__int32=int "-D__int64=long long" -fPIC -D__WINE__ -D_REENTRANT -o mmap.o mmap.c
gcc -MMD -c -I. -I. -I../include -I../include -g -O2 -Wall -fno-keep-static-consts -D__const=const -fno-strict-aliasing -Wa,--execstack -D__int8=char -D__int16=short -D__int32=int "-D__int64=long long" -fPIC -D__WINE__ -D_REENTRANT -o mkstemps.o mkstemps.c
gcc -shared -Wl,-soname,libwine_port.so port.o mmap.o mkstemps.o -ldl -lm -o libwine_port.so.1.0
rm -f libwine_port.so && ln -s libwine_port.so.1.0 libwine_port.so
make[1]: Leaving directory `/home/mfrisch/.WineCVS/sources/cvscedega/winex/port'
make[1]: Entering directory `/home/mfrisch/.WineCVS/sources/cvscedega/winex/unicode'
gcc -MMD -c -I. -I. -I../include -I../include -g -O2 -Wall -fno-keep-static-consts -D__const=const -fno-strict-aliasing -Wa,--execstack -D__int8=char -D__int16=short -D__int32=int "-D__int64=long long" -fPIC -D__WINE__ -D_REENTRANT -o casemap.o casemap.c
In file included from ../include/winnt.h:10,
from ../include/windef.h:16,
from ../include/wine/unicode.h:10,
from casemap.c:4:
../include/basetsd.h:153:3: error: #error Unknown CPU architecture!
In file included from ../include/windef.h:16,
from ../include/wine/unicode.h:10,
from casemap.c:4:
../include/winnt.h:1035:2: error: #error You need to define a CONTEXT for your CPU
In file included from ../include/windef.h:16,
from ../include/wine/unicode.h:10,
from casemap.c:4:
../include/winnt.h:1038: error: expected ‘=’, ‘,’, ‘;’, ‘asm’ or ‘__attribute__’ before ‘*’ token
../include/winnt.h:2090: error: expected specifier-qualifier-list before ‘PCONTEXT’
../include/winnt.h:2103: error: expected declaration specifiers or ‘...’ before ‘PCONTEXT’
In file included from ../include/winnls.h:5,
from ../include/wine/unicode.h:11,
from casemap.c:4:
../include/winbase.h:121: error: expected ‘=’, ‘,’, ‘;’, ‘asm’ or ‘__attribute__’ before ‘LPCONTEXT’
../include/winbase.h:1370: error: expected declaration specifiers or ‘...’ before ‘CONTEXT’
../include/winbase.h:1510: warning: type defaults to ‘int’ in declaration of ‘CONTEXT’
../include/winbase.h:1510: error: expected ‘;’, ‘,’ or ‘)’ before ‘*’ token
make[1]: *** [casemap.o] Error 1
make[1]: Leaving directory `/home/mfrisch/.WineCVS/sources/cvscedega/winex/unicode'
make: *** [unicode/libwine_unicode.so] Error 2