All pastes #347434 Raw Edit

Something

public text v1 · immutable
·published 2007-02-09 15:18 UTC
rendered paste body
======================================================================
FAIL: test_expanduser (test.test_posixpath.PosixPathTest)
----------------------------------------------------------------------
Traceback (most recent call last):
  File "/var/tmp/paludis/dev-lang/python-2.4.3-r4/work/Python-2.4.3/Lib/test/test_posixpath.py", line 353, in test_expanduser
    posixpath.expanduser("~/")
AssertionError: '/var/tmp/paludis/dev-lang/python-2.4.3-r4/temp//' != '/var/tmp/paludis/dev-lang/python-2.4.3-r4/temp/'

----------------------------------------------------------------------
Ran 27 tests in 0.029s

FAILED (failures=1)
test test_posixpath failed -- Traceback (most recent call last):
  File "/var/tmp/paludis/dev-lang/python-2.4.3-r4/work/Python-2.4.3/Lib/test/test_posixpath.py", line 353, in test_expanduser
    posixpath.expanduser("~/")
AssertionError: '/var/tmp/paludis/dev-lang/python-2.4.3-r4/temp//' != '/var/tmp/paludis/dev-lang/python-2.4.3-r4/temp/'

make: *** [test] Error 1

!!! ERROR in dev-lang/python-2.4.3-r4:
!!! In src_test at line 309
!!! make test failed

!!! Call stack:
!!!    * src_test (/usr/portage/dev-lang/python/python-2.4.3-r4.ebuild:309)
!!!    * ebuild_f_test (/usr/libexec/paludis/src_test.bash:69)
!!!    * ebuild_main (/usr/libexec/paludis/ebuild.bash:339)
!!!    * main (/usr/libexec/paludis/ebuild.bash:351)


!!! This package failed inside the test phase. You should read
!!!    http://paludis.pioto.org/faq.html
!!! for more information on packages with test phase failures.


die trap: exiting with error.

Install error:
  * In program paludis -i gentoo-sources:
  * When performing install action from command line:
  * When executing install task:
  * Install error: Install failed for 'dev-lang/python-2.4.3-r4::gentoo'


Resume command: paludis --log-level qa --dl-deps-default discard --install '=dev-lang/python-2.4.3-r4::gentoo' '=app-misc/pax-utils-0.1.15::gentoo' '=sys-apps/portage-2.1.1-r2::gentoo' '=sys-apps/texinfo-4.8-r5::gentoo' '=sys-apps/coreutils-6.4::gentoo' '=sys-apps/baselayout-1.12.6::gentoo' '=sys-kernel/gentoo-sources-2.6.19-r6::gentoo' --add-to-world-atom '( sys-kernel/gentoo-sources )'