All pastes #346448 Raw Edit

Stuff

public text v1 · immutable
·published 2007-02-09 11:43 UTC
rendered paste body
***** alsa-driver-1.0.14_rc1-lfepins.patch *****

================================================

PATCH COMMAND:	 patch -p0 -g0 -E --no-backup-if-mismatch < /usr/local/portage/media-sound/alsa-driver/files/alsa-driver-1.0.14_rc1-lfepins.patch

================================================
can't find file to patch at input line 3
Perhaps you used the wrong -p or --strip option?
The text leading up to this was:
--------------------------
|--- alsa-driver-1.0.14rc1/alsa-kernel/pci/hda/patch_sigmatel.c
|+++ alsa-driver-1.0.14rc1/alsa-kernel/pci/hda/patch_sigmatel.c
--------------------------
No file to patch.  Skipping patch.
3 out of 3 hunks ignored
================================================

PATCH COMMAND:	 patch -p1 -g0 -E --no-backup-if-mismatch < /usr/local/portage/media-sound/alsa-driver/files/alsa-driver-1.0.14_rc1-lfepins.patch

================================================
patching file alsa-kernel/pci/hda/patch_sigmatel.c
Hunk #1 FAILED at 38.
Hunk #2 FAILED at 328.
Hunk #3 FAILED at 351.
3 out of 3 hunks FAILED -- saving rejects to file alsa-kernel/pci/hda/patch_sigmatel.c.rej
================================================

PATCH COMMAND:	 patch -p2 -g0 -E --no-backup-if-mismatch < /usr/local/portage/media-sound/alsa-driver/files/alsa-driver-1.0.14_rc1-lfepins.patch

================================================
patching file pci/hda/patch_sigmatel.c
Hunk #1 FAILED at 38.
Hunk #2 FAILED at 328.
Hunk #3 FAILED at 351.
3 out of 3 hunks FAILED -- saving rejects to file pci/hda/patch_sigmatel.c.rej
================================================

PATCH COMMAND:	 patch -p3 -g0 -E --no-backup-if-mismatch < /usr/local/portage/media-sound/alsa-driver/files/alsa-driver-1.0.14_rc1-lfepins.patch

================================================
can't find file to patch at input line 3
Perhaps you used the wrong -p or --strip option?
The text leading up to this was:
--------------------------
|--- alsa-driver-1.0.14rc1/alsa-kernel/pci/hda/patch_sigmatel.c
|+++ alsa-driver-1.0.14rc1/alsa-kernel/pci/hda/patch_sigmatel.c
--------------------------
No file to patch.  Skipping patch.
3 out of 3 hunks ignored
================================================

PATCH COMMAND:	 patch -p4 -g0 -E --no-backup-if-mismatch < /usr/local/portage/media-sound/alsa-driver/files/alsa-driver-1.0.14_rc1-lfepins.patch

================================================
can't find file to patch at input line 3
Perhaps you used the wrong -p or --strip option?
The text leading up to this was:
--------------------------
|--- alsa-driver-1.0.14rc1/alsa-kernel/pci/hda/patch_sigmatel.c
|+++ alsa-driver-1.0.14rc1/alsa-kernel/pci/hda/patch_sigmatel.c
--------------------------
No file to patch.  Skipping patch.
3 out of 3 hunks ignored