All pastes #346440 Raw Edit

Someone

public text v1 · immutable
·published 2007-02-09 11:28 UTC
rendered paste body
berylsettings.c:6494: warning: excess elements in struct initializer
berylsettings.c:6494: warning: (near initialization for '__pyx_string_tab[9]')
berylsettings.c:6494: warning: excess elements in struct initializer
berylsettings.c:6494: warning: (near initialization for '__pyx_string_tab[9]')
berylsettings.c:6494: warning: excess elements in struct initializer
berylsettings.c:6494: warning: (near initialization for '__pyx_string_tab[9]')
berylsettings.c:6495: error: '__pyx_k49p' undeclared here (not in a function)
berylsettings.c:6495: warning: excess elements in struct initializer
berylsettings.c:6495: warning: (near initialization for '__pyx_string_tab[10]')
berylsettings.c:6495: warning: excess elements in struct initializer
berylsettings.c:6495: warning: (near initialization for '__pyx_string_tab[10]')
berylsettings.c:6495: warning: excess elements in struct initializer
berylsettings.c:6495: warning: (near initialization for '__pyx_string_tab[10]')
berylsettings.c:6496: error: '__pyx_k51p' undeclared here (not in a function)
berylsettings.c:6496: warning: excess elements in struct initializer
berylsettings.c:6496: warning: (near initialization for '__pyx_string_tab[11]')
berylsettings.c:6496: warning: excess elements in struct initializer
berylsettings.c:6496: warning: (near initialization for '__pyx_string_tab[11]')
berylsettings.c:6496: warning: excess elements in struct initializer
berylsettings.c:6496: warning: (near initialization for '__pyx_string_tab[11]')
berylsettings.c:6497: error: '__pyx_k52p' undeclared here (not in a function)
berylsettings.c:6497: warning: excess elements in struct initializer
berylsettings.c:6497: warning: (near initialization for '__pyx_string_tab[12]')
berylsettings.c:6497: warning: excess elements in struct initializer
berylsettings.c:6497: warning: (near initialization for '__pyx_string_tab[12]')
berylsettings.c:6497: warning: excess elements in struct initializer
berylsettings.c:6497: warning: (near initialization for '__pyx_string_tab[12]')
berylsettings.c:6498: error: '__pyx_k53p' undeclared here (not in a function)
berylsettings.c:6498: warning: excess elements in struct initializer
berylsettings.c:6498: warning: (near initialization for '__pyx_string_tab[13]')
berylsettings.c:6498: warning: excess elements in struct initializer
berylsettings.c:6498: warning: (near initialization for '__pyx_string_tab[13]')
berylsettings.c:6498: warning: excess elements in struct initializer
berylsettings.c:6498: warning: (near initialization for '__pyx_string_tab[13]')
berylsettings.c:6499: error: '__pyx_k54p' undeclared here (not in a function)
berylsettings.c:6499: warning: excess elements in struct initializer
berylsettings.c:6499: warning: (near initialization for '__pyx_string_tab[14]')
berylsettings.c:6499: warning: excess elements in struct initializer
berylsettings.c:6499: warning: (near initialization for '__pyx_string_tab[14]')
berylsettings.c:6499: warning: excess elements in struct initializer
berylsettings.c:6499: warning: (near initialization for '__pyx_string_tab[14]')
berylsettings.c:6500: error: '__pyx_k62p' undeclared here (not in a function)
berylsettings.c:6500: warning: excess elements in struct initializer
berylsettings.c:6500: warning: (near initialization for '__pyx_string_tab[15]')
berylsettings.c:6500: warning: excess elements in struct initializer
berylsettings.c:6500: warning: (near initialization for '__pyx_string_tab[15]')
berylsettings.c:6500: warning: excess elements in struct initializer
berylsettings.c:6500: warning: (near initialization for '__pyx_string_tab[15]')
berylsettings.c:6501: error: '__pyx_k64p' undeclared here (not in a function)
berylsettings.c:6501: warning: excess elements in struct initializer
berylsettings.c:6501: warning: (near initialization for '__pyx_string_tab[16]')
berylsettings.c:6501: warning: excess elements in struct initializer
berylsettings.c:6501: warning: (near initialization for '__pyx_string_tab[16]')
berylsettings.c:6501: warning: excess elements in struct initializer
berylsettings.c:6501: warning: (near initialization for '__pyx_string_tab[16]')
berylsettings.c:6502: error: '__pyx_k65p' undeclared here (not in a function)
berylsettings.c:6502: warning: excess elements in struct initializer
berylsettings.c:6502: warning: (near initialization for '__pyx_string_tab[17]')
berylsettings.c:6502: warning: excess elements in struct initializer
berylsettings.c:6502: warning: (near initialization for '__pyx_string_tab[17]')
berylsettings.c:6502: warning: excess elements in struct initializer
berylsettings.c:6502: warning: (near initialization for '__pyx_string_tab[17]')
berylsettings.c:6503: error: '__pyx_k67p' undeclared here (not in a function)
berylsettings.c:6503: warning: excess elements in struct initializer
berylsettings.c:6503: warning: (near initialization for '__pyx_string_tab[18]')
berylsettings.c:6503: warning: excess elements in struct initializer
berylsettings.c:6503: warning: (near initialization for '__pyx_string_tab[18]')
berylsettings.c:6503: warning: excess elements in struct initializer
berylsettings.c:6503: warning: (near initialization for '__pyx_string_tab[18]')
berylsettings.c:6504: error: '__pyx_k69p' undeclared here (not in a function)
berylsettings.c:6504: warning: excess elements in struct initializer
berylsettings.c:6504: warning: (near initialization for '__pyx_string_tab[19]')
berylsettings.c:6504: warning: excess elements in struct initializer
berylsettings.c:6504: warning: (near initialization for '__pyx_string_tab[19]')
berylsettings.c:6504: warning: excess elements in struct initializer
berylsettings.c:6504: warning: (near initialization for '__pyx_string_tab[19]')
berylsettings.c:6505: error: '__pyx_k70p' undeclared here (not in a function)
berylsettings.c:6505: warning: excess elements in struct initializer
berylsettings.c:6505: warning: (near initialization for '__pyx_string_tab[20]')
berylsettings.c:6505: warning: excess elements in struct initializer
berylsettings.c:6505: warning: (near initialization for '__pyx_string_tab[20]')
berylsettings.c:6505: warning: excess elements in struct initializer
berylsettings.c:6505: warning: (near initialization for '__pyx_string_tab[20]')
berylsettings.c:6506: warning: excess elements in struct initializer
berylsettings.c:6506: warning: (near initialization for '__pyx_string_tab[21]')
berylsettings.c:6506: warning: excess elements in struct initializer
berylsettings.c:6506: warning: (near initialization for '__pyx_string_tab[21]')
berylsettings.c:6506: warning: excess elements in struct initializer
berylsettings.c:6506: warning: (near initialization for '__pyx_string_tab[21]')
berylsettings.c:6509: error: expected '=', ',', ';', 'asm' or '__attribute__' before '*' token
berylsettings.c:6518: error: expected ')' before '*' token
berylsettings.c:6523: error: expected ')' before '*' token
berylsettings.c:6529: error: expected ')' before '*' token
berylsettings.c:6534: error: expected '=', ',', ';', 'asm' or '__attribute__' before '*' token
berylsettings.c:6538: error: expected '=', ',', ';', 'asm' or '__attribute__' before '*' token
berylsettings.c:6542: error: expected '=', ',', ';', 'asm' or '__attribute__' before '*' token
berylsettings.c:6546: error: array type has incomplete element type
berylsettings.c:6550: error: array type has incomplete element type
berylsettings.c:6551: error: '__pyx_getprop_13berylsettings_7Backend_Name' undeclared here (not in a function)
berylsettings.c:6552: error: '__pyx_getprop_13berylsettings_7Backend_ShortDesc' undeclared here (not in a function)
berylsettings.c:6553: error: '__pyx_getprop_13berylsettings_7Backend_IntegrationSupport' undeclared here (not in a function)
berylsettings.c:6557: error: expected '=', ',', ';', 'asm' or '__attribute__' before '__pyx_tp_as_number_Backend'
berylsettings.c:6598: error: expected '=', ',', ';', 'asm' or '__attribute__' before '__pyx_tp_as_sequence_Backend'
berylsettings.c:6611: error: expected '=', ',', ';', 'asm' or '__attribute__' before '__pyx_tp_as_mapping_Backend'
berylsettings.c:6617: error: expected '=', ',', ';', 'asm' or '__attribute__' before '__pyx_tp_as_buffer_Backend'
berylsettings.c:6624: error: expected '=', ',', ';', 'asm' or '__attribute__' before '__pyx_type_13berylsettings_Backend'
berylsettings.c:6673: error: expected '=', ',', ';', 'asm' or '__attribute__' before '*' token
berylsettings.c:6682: error: expected ')' before '*' token
berylsettings.c:6696: error: expected ')' before '*' token
berylsettings.c:6702: error: expected ')' before '*' token
berylsettings.c:6707: error: expected '=', ',', ';', 'asm' or '__attribute__' before '*' token
berylsettings.c:6711: error: expected ')' before '*' token
berylsettings.c:6721: error: expected '=', ',', ';', 'asm' or '__attribute__' before '*' token
berylsettings.c:6725: error: expected '=', ',', ';', 'asm' or '__attribute__' before '*' token
berylsettings.c:6729: error: expected '=', ',', ';', 'asm' or '__attribute__' before '*' token
berylsettings.c:6733: error: expected ')' before '*' token
berylsettings.c:6743: error: expected '=', ',', ';', 'asm' or '__attribute__' before '*' token
berylsettings.c:6747: error: expected '=', ',', ';', 'asm' or '__attribute__' before '*' token
berylsettings.c:6751: error: expected ')' before '*' token
berylsettings.c:6761: error: expected '=', ',', ';', 'asm' or '__attribute__' before '*' token
berylsettings.c:6765: error: array type has incomplete element type
berylsettings.c:6766: error: 'PyCFunction' undeclared here (not in a function)
berylsettings.c:6766: error: expected '}' before '__pyx_f_13berylsettings_7Context_EdgeOwner'
berylsettings.c:6767: error: expected '}' before '__pyx_f_13berylsettings_7Context_Conflicts'
berylsettings.c:6768: error: expected '}' before '__pyx_f_13berylsettings_7Context_Read'
berylsettings.c:6769: error: expected '}' before '__pyx_f_13berylsettings_7Context_Write'
berylsettings.c:6770: error: expected '}' before '__pyx_f_13berylsettings_7Context_Import'
berylsettings.c:6771: error: expected '}' before '__pyx_f_13berylsettings_7Context_Export'
berylsettings.c:6772: error: expected '}' before '__pyx_f_13berylsettings_7Context_DeleteProfile'
berylsettings.c:6773: error: expected '}' before '__pyx_f_13berylsettings_7Context_Plugin'
berylsettings.c:6777: error: array type has incomplete element type
berylsettings.c:6778: error: '__pyx_getprop_13berylsettings_7Context_Backend' undeclared here (not in a function)
berylsettings.c:6778: error: '__pyx_setprop_13berylsettings_7Context_Backend' undeclared here (not in a function)
berylsettings.c:6779: error: '__pyx_getprop_13berylsettings_7Context_Categories' undeclared here (not in a function)
berylsettings.c:6780: error: '__pyx_getprop_13berylsettings_7Context_Plugins' undeclared here (not in a function)
berylsettings.c:6781: error: '__pyx_getprop_13berylsettings_7Context_Profile' undeclared here (not in a function)
berylsettings.c:6781: error: '__pyx_setprop_13berylsettings_7Context_Profile' undeclared here (not in a function)
berylsettings.c:6782: error: '__pyx_getprop_13berylsettings_7Context_Profiles' undeclared here (not in a function)
berylsettings.c:6783: error: '__pyx_getprop_13berylsettings_7Context_Integrated' undeclared here (not in a function)
berylsettings.c:6783: error: '__pyx_setprop_13berylsettings_7Context_Integrated' undeclared here (not in a function)
berylsettings.c:6784: error: '__pyx_getprop_13berylsettings_7Context_ActivePlugins' undeclared here (not in a function)
berylsettings.c:6788: error: expected '=', ',', ';', 'asm' or '__attribute__' before '__pyx_tp_as_number_Context'
berylsettings.c:6829: error: expected '=', ',', ';', 'asm' or '__attribute__' before '__pyx_tp_as_sequence_Context'
berylsettings.c:6842: error: expected '=', ',', ';', 'asm' or '__attribute__' before '__pyx_tp_as_mapping_Context'
berylsettings.c:6848: error: expected '=', ',', ';', 'asm' or '__attribute__' before '__pyx_tp_as_buffer_Context'
berylsettings.c:6855: error: expected '=', ',', ';', 'asm' or '__attribute__' before '__pyx_type_13berylsettings_Context'
berylsettings.c:6904: error: expected '=', ',', ';', 'asm' or '__attribute__' before '*' token
berylsettings.c:6914: error: expected ')' before '*' token
berylsettings.c:6920: error: expected ')' before '*' token
berylsettings.c:6929: error: expected ')' before '*' token
berylsettings.c:6936: error: expected '=', ',', ';', 'asm' or '__attribute__' before '*' token
berylsettings.c:6940: error: expected '=', ',', ';', 'asm' or '__attribute__' before '*' token
berylsettings.c:6944: error: expected '=', ',', ';', 'asm' or '__attribute__' before '*' token
berylsettings.c:6948: error: expected '=', ',', ';', 'asm' or '__attribute__' before '*' token
berylsettings.c:6952: error: array type has incomplete element type
berylsettings.c:6956: error: array type has incomplete element type
berylsettings.c:6957: error: '__pyx_getprop_13berylsettings_8Category_Name' undeclared here (not in a function)
berylsettings.c:6958: error: '__pyx_getprop_13berylsettings_8Category_ShortDesc' undeclared here (not in a function)
berylsettings.c:6959: error: '__pyx_getprop_13berylsettings_8Category_LongDesc' undeclared here (not in a function)
berylsettings.c:6960: error: '__pyx_getprop_13berylsettings_8Category_Plugins' undeclared here (not in a function)
berylsettings.c:6964: error: expected '=', ',', ';', 'asm' or '__attribute__' before '__pyx_tp_as_number_Category'
berylsettings.c:7005: error: expected '=', ',', ';', 'asm' or '__attribute__' before '__pyx_tp_as_sequence_Category'
berylsettings.c:7018: error: expected '=', ',', ';', 'asm' or '__attribute__' before '__pyx_tp_as_mapping_Category'
berylsettings.c:7024: error: expected '=', ',', ';', 'asm' or '__attribute__' before '__pyx_tp_as_buffer_Category'
berylsettings.c:7031: error: expected '=', ',', ';', 'asm' or '__attribute__' before '__pyx_type_13berylsettings_Category'
berylsettings.c:7080: error: expected '=', ',', ';', 'asm' or '__attribute__' before '*' token
berylsettings.c:7090: error: expected ')' before '*' token
berylsettings.c:7096: error: expected ')' before '*' token
berylsettings.c:7105: error: expected ')' before '*' token
berylsettings.c:7112: error: expected '=', ',', ';', 'asm' or '__attribute__' before '*' token
berylsettings.c:7116: error: expected ')' before '*' token
berylsettings.c:7126: error: expected '=', ',', ';', 'asm' or '__attribute__' before '*' token
berylsettings.c:7130: error: expected '=', ',', ';', 'asm' or '__attribute__' before '*' token
berylsettings.c:7134: error: expected '=', ',', ';', 'asm' or '__attribute__' before '*' token
berylsettings.c:7138: error: expected '=', ',', ';', 'asm' or '__attribute__' before '*' token
berylsettings.c:7142: error: expected '=', ',', ';', 'asm' or '__attribute__' before '*' token
berylsettings.c:7146: error: expected '=', ',', ';', 'asm' or '__attribute__' before '*' token
berylsettings.c:7150: error: expected '=', ',', ';', 'asm' or '__attribute__' before '*' token
berylsettings.c:7154: error: array type has incomplete element type
berylsettings.c:7155: error: expected '}' before '__pyx_f_13berylsettings_6Plugin_Group'
berylsettings.c:7156: error: expected '}' before '__pyx_f_13berylsettings_6Plugin_Setting'
berylsettings.c:7160: error: array type has incomplete element type
berylsettings.c:7161: error: '__pyx_getprop_13berylsettings_6Plugin_Enabled' undeclared here (not in a function)
berylsettings.c:7161: error: '__pyx_setprop_13berylsettings_6Plugin_Enabled' undeclared here (not in a function)
berylsettings.c:7162: error: '__pyx_getprop_13berylsettings_6Plugin_Name' undeclared here (not in a function)
berylsettings.c:7163: error: '__pyx_getprop_13berylsettings_6Plugin_ShortDesc' undeclared here (not in a function)
berylsettings.c:7164: error: '__pyx_getprop_13berylsettings_6Plugin_LongDesc' undeclared here (not in a function)
berylsettings.c:7165: error: '__pyx_getprop_13berylsettings_6Plugin_Settings' undeclared here (not in a function)
berylsettings.c:7166: error: '__pyx_getprop_13berylsettings_6Plugin_Groups' undeclared here (not in a function)
berylsettings.c:7167: error: '__pyx_getprop_13berylsettings_6Plugin_Provides' undeclared here (not in a function)
berylsettings.c:7168: error: '__pyx_getprop_13berylsettings_6Plugin_Requires' undeclared here (not in a function)
berylsettings.c:7172: error: expected '=', ',', ';', 'asm' or '__attribute__' before '__pyx_tp_as_number_Plugin'
berylsettings.c:7213: error: expected '=', ',', ';', 'asm' or '__attribute__' before '__pyx_tp_as_sequence_Plugin'
berylsettings.c:7226: error: expected '=', ',', ';', 'asm' or '__attribute__' before '__pyx_tp_as_mapping_Plugin'
berylsettings.c:7232: error: expected '=', ',', ';', 'asm' or '__attribute__' before '__pyx_tp_as_buffer_Plugin'
berylsettings.c:7239: error: expected '=', ',', ';', 'asm' or '__attribute__' before '__pyx_type_13berylsettings_Plugin'
berylsettings.c:7288: error: expected '=', ',', ';', 'asm' or '__attribute__' before '*' token
berylsettings.c:7298: error: expected ')' before '*' token
berylsettings.c:7304: error: expected ')' before '*' token
berylsettings.c:7313: error: expected ')' before '*' token
berylsettings.c:7320: error: expected '=', ',', ';', 'asm' or '__attribute__' before '*' token
berylsettings.c:7324: error: expected '=', ',', ';', 'asm' or '__attribute__' before '*' token
berylsettings.c:7328: error: expected '=', ',', ';', 'asm' or '__attribute__' before '*' token
berylsettings.c:7332: error: expected '=', ',', ';', 'asm' or '__attribute__' before '*' token
berylsettings.c:7336: error: array type has incomplete element type
berylsettings.c:7337: error: expected '}' before '__pyx_f_13berylsettings_5Group_SubGroup'
berylsettings.c:7341: error: array type has incomplete element type
berylsettings.c:7342: error: '__pyx_getprop_13berylsettings_5Group_Plugin' undeclared here (not in a function)
berylsettings.c:7343: error: '__pyx_getprop_13berylsettings_5Group_Name' undeclared here (not in a function)
berylsettings.c:7344: error: '__pyx_getprop_13berylsettings_5Group_Desc' undeclared here (not in a function)
berylsettings.c:7345: error: '__pyx_getprop_13berylsettings_5Group_SubGroups' undeclared here (not in a function)
berylsettings.c:7349: error: expected '=', ',', ';', 'asm' or '__attribute__' before '__pyx_tp_as_number_Group'
berylsettings.c:7390: error: expected '=', ',', ';', 'asm' or '__attribute__' before '__pyx_tp_as_sequence_Group'
berylsettings.c:7403: error: expected '=', ',', ';', 'asm' or '__attribute__' before '__pyx_tp_as_mapping_Group'
berylsettings.c:7409: error: expected '=', ',', ';', 'asm' or '__attribute__' before '__pyx_tp_as_buffer_Group'
berylsettings.c:7416: error: expected '=', ',', ';', 'asm' or '__attribute__' before '__pyx_type_13berylsettings_Group'
berylsettings.c:7465: error: expected '=', ',', ';', 'asm' or '__attribute__' before '*' token
berylsettings.c:7476: error: expected ')' before '*' token
berylsettings.c:7483: error: expected ')' before '*' token
berylsettings.c:7495: error: expected ')' before '*' token
berylsettings.c:7504: error: expected '=', ',', ';', 'asm' or '__attribute__' before '*' token
berylsettings.c:7508: error: expected '=', ',', ';', 'asm' or '__attribute__' before '*' token
berylsettings.c:7512: error: expected '=', ',', ';', 'asm' or '__attribute__' before '*' token
berylsettings.c:7516: error: array type has incomplete element type
berylsettings.c:7517: error: expected '}' before '__pyx_f_13berylsettings_8SubGroup_Setting'
berylsettings.c:7521: error: array type has incomplete element type
berylsettings.c:7522: error: '__pyx_getprop_13berylsettings_8SubGroup_Name' undeclared here (not in a function)
berylsettings.c:7523: error: '__pyx_getprop_13berylsettings_8SubGroup_Desc' undeclared here (not in a function)
berylsettings.c:7524: error: '__pyx_getprop_13berylsettings_8SubGroup_Settings' undeclared here (not in a function)
berylsettings.c:7528: error: expected '=', ',', ';', 'asm' or '__attribute__' before '__pyx_tp_as_number_SubGroup'
berylsettings.c:7569: error: expected '=', ',', ';', 'asm' or '__attribute__' before '__pyx_tp_as_sequence_SubGroup'
berylsettings.c:7582: error: expected '=', ',', ';', 'asm' or '__attribute__' before '__pyx_tp_as_mapping_SubGroup'
berylsettings.c:7588: error: expected '=', ',', ';', 'asm' or '__attribute__' before '__pyx_tp_as_buffer_SubGroup'
berylsettings.c:7595: error: expected '=', ',', ';', 'asm' or '__attribute__' before '__pyx_type_13berylsettings_SubGroup'
berylsettings.c:7644: error: expected '=', ',', ';', 'asm' or '__attribute__' before '*' token
berylsettings.c:7654: error: expected ')' before '*' token
berylsettings.c:7660: error: expected ')' before '*' token
berylsettings.c:7669: error: expected ')' before '*' token
berylsettings.c:7676: error: expected '=', ',', ';', 'asm' or '__attribute__' before '*' token
berylsettings.c:7680: error: expected '=', ',', ';', 'asm' or '__attribute__' before '*' token
berylsettings.c:7684: error: expected '=', ',', ';', 'asm' or '__attribute__' before '*' token
berylsettings.c:7688: error: expected '=', ',', ';', 'asm' or '__attribute__' before '*' token
berylsettings.c:7692: error: expected '=', ',', ';', 'asm' or '__attribute__' before '*' token
berylsettings.c:7696: error: expected '=', ',', ';', 'asm' or '__attribute__' before '*' token
berylsettings.c:7700: error: expected '=', ',', ';', 'asm' or '__attribute__' before '*' token
berylsettings.c:7704: error: expected '=', ',', ';', 'asm' or '__attribute__' before '*' token
berylsettings.c:7708: error: expected '=', ',', ';', 'asm' or '__attribute__' before '*' token
berylsettings.c:7712: error: expected '=', ',', ';', 'asm' or '__attribute__' before '*' token
berylsettings.c:7716: error: expected '=', ',', ';', 'asm' or '__attribute__' before '*' token
berylsettings.c:7720: error: expected '=', ',', ';', 'asm' or '__attribute__' before '*' token
berylsettings.c:7724: error: expected ')' before '*' token
berylsettings.c:7734: error: array type has incomplete element type
berylsettings.c:7735: error: expected '}' before '__pyx_f_13berylsettings_7Setting_ResetToDefault'
berylsettings.c:7736: error: expected '}' before '__pyx_f_13berylsettings_7Setting_HasHint'
berylsettings.c:7737: error: expected '}' before '__pyx_f_13berylsettings_7Setting_Conflicts'
berylsettings.c:7741: error: array type has incomplete element type
berylsettings.c:7742: error: '__pyx_getprop_13berylsettings_7Setting_Plugin' undeclared here (not in a function)
berylsettings.c:7743: error: '__pyx_getprop_13berylsettings_7Setting_Name' undeclared here (not in a function)
berylsettings.c:7744: error: '__pyx_getprop_13berylsettings_7Setting_ShortDesc' undeclared here (not in a function)
berylsettings.c:7745: error: '__pyx_getprop_13berylsettings_7Setting_LongDesc' undeclared here (not in a function)
berylsettings.c:7746: error: '__pyx_getprop_13berylsettings_7Setting_Group' undeclared here (not in a function)
berylsettings.c:7747: error: '__pyx_getprop_13berylsettings_7Setting_SubGroup' undeclared here (not in a function)
berylsettings.c:7748: error: '__pyx_getprop_13berylsettings_7Setting_Advanced' undeclared here (not in a function)
berylsettings.c:7749: error: '__pyx_getprop_13berylsettings_7Setting_Integrated' undeclared here (not in a function)
berylsettings.c:7750: error: '__pyx_getprop_13berylsettings_7Setting_ReadOnly' undeclared here (not in a function)
berylsettings.c:7751: error: '__pyx_getprop_13berylsettings_7Setting_Restrictions' undeclared here (not in a function)
berylsettings.c:7752: error: '__pyx_getprop_13berylsettings_7Setting_Type' undeclared here (not in a function)
berylsettings.c:7753: error: '__pyx_getprop_13berylsettings_7Setting_Value' undeclared here (not in a function)
berylsettings.c:7753: error: '__pyx_setprop_13berylsettings_7Setting_Value' undeclared here (not in a function)
berylsettings.c:7757: error: expected '=', ',', ';', 'asm' or '__attribute__' before '__pyx_tp_as_number_Setting'
berylsettings.c:7798: error: expected '=', ',', ';', 'asm' or '__attribute__' before '__pyx_tp_as_sequence_Setting'
berylsettings.c:7811: error: expected '=', ',', ';', 'asm' or '__attribute__' before '__pyx_tp_as_mapping_Setting'
berylsettings.c:7817: error: expected '=', ',', ';', 'asm' or '__attribute__' before '__pyx_tp_as_buffer_Setting'
berylsettings.c:7824: error: expected '=', ',', ';', 'asm' or '__attribute__' before '__pyx_type_13berylsettings_Setting'
berylsettings.c:7873: error: array type has incomplete element type
berylsettings.c:7874: error: expected '}' before '__pyx_f_13berylsettings_keytostring'
berylsettings.c:7875: error: expected '}' before '__pyx_f_13berylsettings_modstostring'
berylsettings.c:7876: error: expected '}' before '__pyx_f_13berylsettings_buttontostring'
berylsettings.c:7877: error: expected '}' before '__pyx_f_13berylsettings_edgelisttomask'
berylsettings.c:7878: error: expected '}' before '__pyx_f_13berylsettings_edgetolist'
berylsettings.c:7879: error: expected '}' before '__pyx_f_13berylsettings_send_reload'
berylsettings.c:7880: error: expected '}' before '__pyx_f_13berylsettings_Backends'
berylsettings.c:7886: error: expected '=', ',', ';', 'asm' or '__attribute__' before 'initberylsettings'
berylsettings.c:7887: error: expected '=', ',', ';', 'asm' or '__attribute__' before 'initberylsettings'
berylsettings.c:8128: error: expected ')' before '*' token
berylsettings.c:8141: error: expected '=', ',', ';', 'asm' or '__attribute__' before '*' token
berylsettings.c:8149: error: expected '=', ',', ';', 'asm' or '__attribute__' before '*' token
berylsettings.c:8166: error: expected ')' before '*' token
berylsettings.c:8228: error: expected '=', ',', ';', 'asm' or '__attribute__' before '*' token
berylsettings.c: In function '__Pyx_InternStrings':
berylsettings.c:8259: error: '__Pyx_InternTabEntry' has no member named 'p'
berylsettings.c:8260: error: '__Pyx_InternTabEntry' has no member named 'p'
berylsettings.c:8260: error: '__Pyx_InternTabEntry' has no member named 's'
berylsettings.c:8260: warning: assignment makes pointer from integer without a cast
berylsettings.c:8261: error: '__Pyx_InternTabEntry' has no member named 'p'
berylsettings.c: In function '__Pyx_InitStrings':
berylsettings.c:8269: error: '__Pyx_StringTabEntry' has no member named 'p'
berylsettings.c:8270: error: '__Pyx_StringTabEntry' has no member named 'p'
berylsettings.c:8270: error: '__Pyx_StringTabEntry' has no member named 's'
berylsettings.c:8270: error: '__Pyx_StringTabEntry' has no member named 'n'
berylsettings.c:8270: warning: assignment makes pointer from integer without a cast
berylsettings.c:8271: error: '__Pyx_StringTabEntry' has no member named 'p'
berylsettings.c:8278:21: error: compile.h: No such file or directory
berylsettings.c:8279:25: error: frameobject.h: No such file or directory
berylsettings.c:8280:23: error: traceback.h: No such file or directory
berylsettings.c: In function '__Pyx_AddTraceback':
berylsettings.c:8283: error: 'PyObject' undeclared (first use in this function)
berylsettings.c:8283: error: (Each undeclared identifier is reported only once
berylsettings.c:8283: error: for each function it appears in.)
berylsettings.c:8283: error: 'py_srcfile' undeclared (first use in this function)
berylsettings.c:8283: error: invalid operands to binary *
berylsettings.c:8284: error: 'py_funcname' undeclared (first use in this function)
berylsettings.c:8284: error: invalid operands to binary *
berylsettings.c:8285: error: 'py_globals' undeclared (first use in this function)
berylsettings.c:8285: error: invalid operands to binary *
berylsettings.c:8286: error: 'empty_tuple' undeclared (first use in this function)
berylsettings.c:8286: error: invalid operands to binary *
berylsettings.c:8287: error: 'empty_string' undeclared (first use in this function)
berylsettings.c:8287: error: invalid operands to binary *
berylsettings.c:8288: error: 'PyCodeObject' undeclared (first use in this function)
berylsettings.c:8288: error: 'py_code' undeclared (first use in this function)
berylsettings.c:8288: error: invalid operands to binary *
berylsettings.c:8289: error: 'PyFrameObject' undeclared (first use in this function)
berylsettings.c:8289: error: 'py_frame' undeclared (first use in this function)
berylsettings.c:8289: error: invalid operands to binary *
berylsettings.c:8295: error: '__pyx_m' undeclared (first use in this function)
berylsettings.c:8325: error: request for member 'f_lineno' in something not a structure or union
make[2]: *** [berylsettings.lo] Error 1
make[2]: Leaving directory `/home/linux1/src/trunk/beryl-settings-bindings/python'
make[1]: *** [all-recursive] Error 1
make[1]: Leaving directory `/home/linux1/src/trunk/beryl-settings-bindings'
make: *** [all] Error 2
linux1@ubuntu:~/src/trunk/beryl-settings-bindings$