All pastes #346369 Raw Edit

Untitled

public text v1 · immutable
·published 2007-02-09 09:52 UTC
rendered paste body
  LD [M]  /usr/src/asterisk-new/zaptel-1.2.12/wct4xxp/wct4xxp.o
  CC [M]  /usr/src/asterisk-new/zaptel-1.2.12/xpp/card_fxo.o
/usr/src/asterisk-new/zaptel-1.2.12/xpp/card_fxo.c: In function `__check_report_                                             battery':
/usr/src/asterisk-new/zaptel-1.2.12/xpp/card_fxo.c:38: warning: return from inco                                             mpatible pointer type
  CC [M]  /usr/src/asterisk-new/zaptel-1.2.12/xpp/card_fxs.o
/usr/src/asterisk-new/zaptel-1.2.12/xpp/card_fxs.c: In function `__check_poll_di                                             gital_inputs':
/usr/src/asterisk-new/zaptel-1.2.12/xpp/card_fxs.c:37: warning: return from inco                                             mpatible pointer type
  CC [M]  /usr/src/asterisk-new/zaptel-1.2.12/xpp/xbus-core.o
/usr/src/asterisk-new/zaptel-1.2.12/xpp/xbus-core.c:88: warning: `kmem_cache_t'                                              is deprecated (declared at include/linux/slab.h:17)
/usr/src/asterisk-new/zaptel-1.2.12/xpp/xbus-core.c:346:83: macro "INIT_WORK" pa                                             ssed 3 arguments, but takes just 2
/usr/src/asterisk-new/zaptel-1.2.12/xpp/xbus-core.c: In function `xbus_activate'                                             :
/usr/src/asterisk-new/zaptel-1.2.12/xpp/xbus-core.c:346: error: `INIT_WORK' unde                                             clared (first use in this function)
/usr/src/asterisk-new/zaptel-1.2.12/xpp/xbus-core.c:346: error: (Each undeclared                                              identifier is reported only once
/usr/src/asterisk-new/zaptel-1.2.12/xpp/xbus-core.c:346: error: for each functio                                             n it appears in.)
/usr/src/asterisk-new/zaptel-1.2.12/xpp/xbus-core.c: At top level:
/usr/src/asterisk-new/zaptel-1.2.12/xpp/xbus-core.c:213: warning: `xbus_poll' de                                             fined but not used
make[3]: *** [/usr/src/asterisk-new/zaptel-1.2.12/xpp/xbus-core.o] Error 1
make[2]: *** [/usr/src/asterisk-new/zaptel-1.2.12/xpp] Error 2
make[1]: *** [_module_/usr/src/asterisk-new/zaptel-1.2.12] Error 2
make[1]: Leaving directory `/usr/src/linux-2.6.20-gentoo'
make: *** [linux26] Error 2