rendered paste bodyrm -rf profileeditorbase.h;
rm -rf addprofilewidget.h;
/usr/qt/3/bin/uic -L /usr/kde/3.5/lib/kde3/plugins/designer -nounload ./profileeditorbase.ui | /usr/bin/perl -pi -e "s,public QWizard,public KWizard,g; s,#include <qwizard.h>,#include <kwizard.h>,g" >> profileeditorbase.h ;
/usr/qt/3/bin/uic -L /usr/kde/3.5/lib/kde3/plugins/designer -nounload ./addprofilewidget.ui | /usr/bin/perl -pi -e "s,public QWizard,public KWizard,g; s,#include <qwizard.h>,#include <kwizard.h>,g" >> addprofilewidget.h ;
/usr/qt/3/bin/moc ./profileeditor.h -o profileeditor.moc
i686-pc-linux-gnu-g++ -DHAVE_CONFIG_H -I. -I. -I../../.. -I../../../lib -I../../../lib/external_interfaces -I../../../lib/interfaces -I../../../lib/util -I../../../lib/widgets -I../../../src/profileengine/lib -I../../../lib/structure -I/usr/kde/3.5/include -I/usr/qt/3/include -I. -I/usr/kde/3.5/include -DQT_THREAD_SUPPORT -D_REENTRANT -Wno-long-long -Wundef -ansi -D_XOPEN_SOURCE=500 -D_BSD_SOURCE -Wcast-align -Wconversion -Wchar-subscripts -Wall -W -Wpointer-arith -fno-builtin -g3 -fno-inline -pipe -O2 -march=pentium4 -Wformat-security -Wmissing-format-attribute -Wno-non-virtual-dtor -fno-exceptions -fno-check-new -fno-common -DQT_CLEAN_NAMESPACE -DQT_NO_ASCII_CAST -DQT_NO_STL -DQT_NO_COMPAT -DQT_NO_TRANSLATION -c -o main.o main.cpp
/usr/qt/3/bin/moc addprofilewidget.h -o addprofilewidget.moc
/bin/sh ../../../libtool --silent --tag=CXX --mode=compile i686-pc-linux-gnu-g++ -DHAVE_CONFIG_H -I. -I. -I../../.. -I../../../lib -I../../../lib/external_interfaces -I../../../lib/interfaces -I../../../lib/util -I../../../lib/widgets -I../../../src/profileengine/lib -I../../../lib/structure -I/usr/kde/3.5/include -I/usr/qt/3/include -I. -I/usr/kde/3.5/include -DQT_THREAD_SUPPORT -D_REENTRANT -Wno-long-long -Wundef -ansi -D_XOPEN_SOURCE=500 -D_BSD_SOURCE -Wcast-align -Wconversion -Wchar-subscripts -Wall -W -Wpointer-arith -fno-builtin -g3 -fno-inline -pipe -O2 -march=pentium4 -Wformat-security -Wmissing-format-attribute -Wno-non-virtual-dtor -fno-exceptions -fno-check-new -fno-common -DQT_CLEAN_NAMESPACE -DQT_NO_ASCII_CAST -DQT_NO_STL -DQT_NO_COMPAT -DQT_NO_TRANSLATION -c -o profileeditor.lo profileeditor.cpp
/usr/qt/3/bin/moc profileeditorbase.h -o profileeditorbase.moc
rm -f addprofilewidget.cpp
echo '#include <kdialog.h>' > addprofilewidget.cpp
profileeditor.h:28: error: expected class-name before '{' token
profileeditor.h:38: error: 'QListBoxItem' has not been declared
profileeditor.h:39: error: 'QListViewItem' has not been declared
main.cpp: In function 'int main(int, char**)':
main.cpp:41: error: 'class ProfileEditor' has no member named 'show'
main.cpp:42: error: no matching function for call to 'KApplication::setMainWidget(ProfileEditor*)'
/usr/qt/3/include/qapplication.h:122: note: candidates are: virtual void QApplication::setMainWidget(QWidget*)
echo '#include <klocale.h>' >> addprofilewidget.cpp
make[4]: *** [main.o] Error 1
make[4]: *** Waiting for unfinished jobs....
/usr/qt/3/bin/uic -L /usr/kde/3.5/lib/kde3/plugins/designer -nounload -tr tr2i18n -i addprofilewidget.h ./addprofilewidget.ui > addprofilewidget.cpp.temp ; ret=$?; \
/usr/bin/perl -pe "s,tr2i18n( \"\" ),QString::null,g" addprofilewidget.cpp.temp | /usr/bin/perl -pe "s,tr2i18n( \"\"\, \"\" ),QString::null,g" | /usr/bin/perl -pe "s,image([0-9][0-9]*)_data,img\$1_addprofilewidget,g" | /usr/bin/perl -pe "s,: QWizard\(,: KWizard(,g" >> addprofilewidget.cpp ;\
rm -f addprofilewidget.cpp.temp ;\
if test "$ret" = 0; then echo '#include "addprofilewidget.moc"' >> addprofilewidget.cpp; else rm -f addprofilewidget.cpp ; exit $ret ; fi
make[4]: Leaving directory `/var/tmp/portage/kdevelop-3.4.0-r1/work/kdevelop-3.4.0/src/profileengine/editor'
make[3]: *** [all-recursive] Error 1
make[3]: Leaving directory `/var/tmp/portage/kdevelop-3.4.0-r1/work/kdevelop-3.4.0/src/profileengine'
make[2]: *** [all-recursive] Error 1
make[2]: Leaving directory `/var/tmp/portage/kdevelop-3.4.0-r1/work/kdevelop-3.4.0/src'
make[1]: *** [all-recursive] Error 1
make[1]: Leaving directory `/var/tmp/portage/kdevelop-3.4.0-r1/work/kdevelop-3.4.0'
make: *** [all] Error 2
!!! ERROR: dev-util/kdevelop-3.4.0-r1 failed.
Call stack:
ebuild.sh, line 1546: Called dyn_compile
ebuild.sh, line 937: Called src_compile
kdevelop-3.4.0-r1.ebuild, line 63: Called kde_src_compile
kde.eclass, line 170: Called kde_src_compile 'all'
kde.eclass, line 340: Called kde_src_compile 'myconf' 'configure' 'make'
kde.eclass, line 336: Called die
!!! died running emake, kde_src_compile:make
!!! If you need support, post the topmost build error, and the call stack if relevant.