All pastes #345356 Raw Edit

jags

public text v1 · immutable
·published 2007-02-08 13:14 UTC
rendered paste body
*** Checking out evolution-data-server *** [1/1]

cvs -z3 -q -d :pserver:anonymous@anoncvs.gnome.org:/cvs/gnome update -P -d -r gnome-2-16 .
? COPYING.autogen_bak
? INSTALL.autogen_bak
M COPYING
*** Configuring evolution-data-server *** [1/1]

./autogen.sh --prefix /opt/gnome2  --enable-nss=yes --with-nss-includes=/usr/include/nss.h --with-nss-libs=/usr/lib/ --with-nspr-includes=/usr/include/nspr4 --with-nspr-libs=/usr/lib/
/opt/gnome/bin/gnome-autogen.sh
checking for autoconf >= 2.53...
  testing autoconf2.50... not found.
  testing autoconf... found 2.60
checking for automake >= 1.6...
  testing automake-1.6... not found.
  testing automake-1.7... found 1.7.9
checking for libtool >= 1.4.3...
  testing libtoolize... found 1.5.22
checking for glib-gettext >= 2.2.0...
  testing glib-gettextize... found 2.12.4
checking for intltool >= 0.25...
  testing intltoolize... found 0.35.0
checking for pkg-config >= 0.14.0...
  testing pkg-config... found 0.20
checking for gtk-doc >= 1.0...
  testing gtkdocize... found 1.7
Checking for required M4 macros...
Checking for forbidden M4 macros...
Processing ./configure.in
Running libtoolize...
Running glib-gettextize... Ignore non-fatal messages.
Copying file mkinstalldirs
Copying file po/Makefile.in.in

Please add the files
  codeset.m4 gettext.m4 glibc21.m4 iconv.m4 isc-posix.m4 lcmessage.m4
  progtest.m4
from the /opt/gnome/share/aclocal directory to your autoconf macro directory
or directly to your aclocal.m4 file.
You will also need config.guess and config.sub, which you can get from
ftp://ftp.gnu.org/pub/gnu/config/.

Running intltoolize...
Running gtkdocize...
Running aclocal-1.7...
Running autoconf...
configure.in:113: warning: AC_ARG_PROGRAM invoked multiple times
configure.in:1325: warning: AC_CACHE_VAL(largefile_support, ...): suspicious presence of an AC_DEFINE in the second argument, where no actions should be taken
../../lib/autoconf/general.m4:1922: AC_CACHE_VAL is expanded from...
../../lib/autoconf/general.m4:1935: AC_CACHE_CHECK is expanded from...
configure.in:1325: the top level
Running autoheader...
configure.in:113: warning: AC_ARG_PROGRAM invoked multiple times
configure.in:1325: warning: AC_CACHE_VAL(largefile_support, ...): suspicious presence of an AC_DEFINE in the second argument, where no actions should be taken
../../lib/autoconf/general.m4:1922: AC_CACHE_VAL is expanded from...
../../lib/autoconf/general.m4:1935: AC_CACHE_CHECK is expanded from...
configure.in:1325: the top level
Running automake-1.7...
configure.in:113: warning: AC_ARG_PROGRAM invoked multiple times
configure.in:1325: warning: AC_CACHE_VAL(largefile_support, ...): suspicious presence of an AC_DEFINE in the second argument, where no actions should be taken
../../lib/autoconf/general.m4:1922: AC_CACHE_VAL is expanded from...
../../lib/autoconf/general.m4:1935: AC_CACHE_CHECK is expanded from...
configure.in:1325: the top level
calendar/Makefile.am:1: required directory calendar/libical does not exist
*** error during stage configure of evolution-data-server: Error running ./autogen.sh --prefix /opt/gnome2  --enable-nss=yes --with-nss-includes=/usr/include/nss.h --with-nss-libs=/usr/lib/ --with-nspr-includes=/usr/include/nspr4 --with-nspr-libs=/usr/lib/ *** [1/1]


  [1] rerun stage configure
  [2] ignore error and continue to build
  [3] give up on module
  [4] start shell
  [5] go to stage force_checkout
choice: 2
*** Building evolution-data-server *** [1/1]

make  
make: *** No targets specified and no makefile found.  Stop.
*** error during stage build of evolution-data-server: Error running make   *** [1/1]


  [1] rerun stage build
  [2] ignore error and continue to install
  [3] give up on module
  [4] start shell
  [5] go to stage force_checkout
  [6] go to stage configure
choice: 2
*** Installing evolution-data-server *** [1/1]

make   install
make: *** No rule to make target `install'.  Stop.
*** error during stage install of evolution-data-server: Error running make   install *** [1/1]


  [1] rerun stage install
  [2] ignore error and continue to done
  [3] give up on module
  [4] start shell
choice: 2
*** success *** [1/1]