All pastes #345040 Raw Edit

Someone

public text v1 · immutable
·published 2007-02-08 05:58 UTC
rendered paste body
{{{
configure: error: cannot find install-sh or install.sh in autotools "."/autotools

Now type 'make' to compile dbus-python.
*** Building dbus-python *** [9/40]

make
make: *** No se especificó ningún objetivo y no se encontró ningún makefile.  Alto.
*** error during stage build of dbus-python: Error running make   *** [9/40]


  [1] rerun stage build
  [2] ignore error and continue to install
  [3] give up on module
  [4] start shell
  [5] go to stage force_checkout
  [6] go to stage configure
choice:2
}}}