All pastes #344508 Raw Edit

Unnamed

public text v1 · immutable
·published 2007-02-07 20:15 UTC
rendered paste body
This file contains any messages produced by compilers while
running configure, to aid debugging if configure makes a mistake.

It was created by configure, which was
generated by GNU Autoconf 2.60.  Invocation command line was

  $ ./configure --prefix=/usr --host=i686-pc-linux-gnu --mandir=/usr/share/man --infodir=/usr/share/info --datadir=/usr/share --sysconfdir=/etc --localstatedir=/var/lib --with-preview=yes --with-glib=system --with-gc=included --with-tls=__thread --build=i686-pc-linux-gnu --disable-shared-handles

## --------- ##
## Platform. ##
## --------- ##

hostname = jupiter
uname -m = i686
uname -r = 2.6.19-hardened-r5
uname -s = Linux
uname -v = #3 SMP PREEMPT Mon Feb 5 11:39:23 EET 2007

/usr/bin/uname -p = Genuine Intel(R) CPU           T2300  @ 1.66GHz
/bin/uname -X     = unknown

/bin/arch              = i686
/usr/bin/arch -k       = unknown
/usr/convex/getsysinfo = unknown
/usr/bin/hostinfo      = unknown
/bin/machine           = unknown
/usr/bin/oslevel       = unknown
/bin/universe          = unknown

PATH: /usr/local/sbin
PATH: /usr/local/bin
PATH: /usr/sbin
PATH: /usr/bin
PATH: /sbin
PATH: /bin
PATH: /opt/bin
PATH: /usr/i686-pc-linux-gnu/gcc-bin/3.4.6
PATH: /opt/bioapi/bin
PATH: /opt/blackdown-jdk-1.4.2.03/bin
PATH: /opt/blackdown-jdk-1.4.2.03/jre/bin
PATH: /usr/kde/3.5/sbin
PATH: /usr/kde/3.5/bin
PATH: /usr/qt/3/bin


## ----------- ##
## Core tests. ##
## ----------- ##

configure:2089: checking build system type
configure:2107: result: i686-pc-linux-gnu
configure:2129: checking host system type
configure:2144: result: i686-pc-linux-gnu
configure:2166: checking target system type
configure:2181: result: i686-pc-linux-gnu
configure:2230: checking for a BSD-compatible install
configure:2286: result: /usr/bin/install -c
configure:2297: checking whether build environment is sane
configure:2340: result: yes
configure:2405: checking for gawk
configure:2421: found /usr/bin/gawk
configure:2432: result: gawk
configure:2443: checking whether make sets $(MAKE)
configure:2464: result: yes
configure:2643: checking how to create a ustar tar archive
configure:2656: tar --version
tar (GNU tar) 1.16
Copyright (C) 2006 Free Software Foundation, Inc.
This is free software.  You may redistribute copies of it under the terms of
the GNU General Public License <http://www.gnu.org/licenses/gpl.html>.
There is NO WARRANTY, to the extent permitted by law.

Written by John Gilmore and Jay Fenlason.
configure:2659: $? = 0
configure:2699: tardir=conftest.dir && eval tar --format=ustar -chf - "$tardir" >conftest.tar
configure:2702: $? = 0
configure:2706: tar -xf - <conftest.tar
configure:2709: $? = 0
configure:2722: result: gnutar
configure:2729: checking whether to enable maintainer-specific portions of Makefiles
configure:2738: result: no
configure:2757: checking whether ln -s works
configure:2761: result: yes
configure:2808: checking host platform characteristics
configure:3011: result: ok
configure:3036: checking for i686-pc-linux-gnu-gcc
configure:3052: found /usr/bin/i686-pc-linux-gnu-gcc
configure:3063: result: i686-pc-linux-gnu-gcc
configure:3137: checking for i686-pc-linux-gnu-gcc
configure:3164: result: i686-pc-linux-gnu-gcc
configure:3442: checking for C compiler version
configure:3449: i686-pc-linux-gnu-gcc --version >&5
i686-pc-linux-gnu-gcc (GCC) 3.4.6 (Gentoo Hardened 3.4.6-r2, ssp-3.4.6-1.0, pie-8.7.10)
Copyright (C) 2006 Free Software Foundation, Inc.
This is free software; see the source for copying conditions.  There is NO
warranty; not even for MERCHANTABILITY or FITNESS FOR A PARTICULAR PURPOSE.

configure:3452: $? = 0
configure:3459: i686-pc-linux-gnu-gcc -v >&5
Reading specs from /usr/lib/gcc/i686-pc-linux-gnu/3.4.6/specs
Configured with: /var/tmp/portage/gcc-3.4.6-r2/work/gcc-3.4.6/configure --prefix=/usr --bindir=/usr/i686-pc-linux-gnu/gcc-bin/3.4.6 --includedir=/usr/lib/gcc/i686-pc-linux-gnu/3.4.6/include --datadir=/usr/share/gcc-data/i686-pc-linux-gnu/3.4.6 --mandir=/usr/share/gcc-data/i686-pc-linux-gnu/3.4.6/man --infodir=/usr/share/gcc-data/i686-pc-linux-gnu/3.4.6/info --with-gxx-include-dir=/usr/lib/gcc/i686-pc-linux-gnu/3.4.6/include/g++-v3 --host=i686-pc-linux-gnu --build=i686-pc-linux-gnu --disable-altivec --enable-nls --without-included-gettext --with-system-zlib --disable-checking --disable-werror --enable-secureplt --disable-libunwind-exceptions --disable-multilib --disable-libgcj --enable-languages=c,c++ --enable-shared --enable-threads=posix --enable-__cxa_atexit --enable-clocale=gnu
Thread model: posix
gcc version 3.4.6 (Gentoo Hardened 3.4.6-r2, ssp-3.4.6-1.0, pie-8.7.10)
configure:3462: $? = 0
configure:3469: i686-pc-linux-gnu-gcc -V >&5
i686-pc-linux-gnu-gcc: `-V' option must have argument
configure:3472: $? = 1
configure:3495: checking for C compiler default output file name
configure:3522: i686-pc-linux-gnu-gcc   -DGC_LINUX_THREADS -D_GNU_SOURCE -D_REENTRANT -DUSE_MMAP -DUSE_MUNMAP  conftest.c  >&5
configure:3525: $? = 0
configure:3571: result: a.out
configure:3576: checking whether the C compiler works
configure:3586: ./a.out
configure:3589: $? = 0
configure:3606: result: yes
configure:3613: checking whether we are cross compiling
configure:3615: result: no
configure:3618: checking for suffix of executables
configure:3625: i686-pc-linux-gnu-gcc -o conftest   -DGC_LINUX_THREADS -D_GNU_SOURCE -D_REENTRANT -DUSE_MMAP -DUSE_MUNMAP  conftest.c  >&5
configure:3628: $? = 0
configure:3652: result: 
configure:3658: checking for suffix of object files
configure:3684: i686-pc-linux-gnu-gcc -c   -DGC_LINUX_THREADS -D_GNU_SOURCE -D_REENTRANT -DUSE_MMAP -DUSE_MUNMAP conftest.c >&5
configure:3687: $? = 0
configure:3710: result: o
configure:3714: checking whether we are using the GNU C compiler
configure:3743: i686-pc-linux-gnu-gcc -c   -DGC_LINUX_THREADS -D_GNU_SOURCE -D_REENTRANT -DUSE_MMAP -DUSE_MUNMAP conftest.c >&5
configure:3749: $? = 0
configure:3756: test -z "$ac_c_werror_flag" || test ! -s conftest.err
configure:3759: $? = 0
configure:3766: test -s conftest.o
configure:3769: $? = 0
configure:3783: result: yes
configure:3788: checking whether i686-pc-linux-gnu-gcc accepts -g
configure:3818: i686-pc-linux-gnu-gcc -c -g  -DGC_LINUX_THREADS -D_GNU_SOURCE -D_REENTRANT -DUSE_MMAP -DUSE_MUNMAP conftest.c >&5
configure:3824: $? = 0
configure:3831: test -z "$ac_c_werror_flag" || test ! -s conftest.err
configure:3834: $? = 0
configure:3841: test -s conftest.o
configure:3844: $? = 0
configure:3974: result: yes
configure:3991: checking for i686-pc-linux-gnu-gcc option to accept ISO C89
configure:4065: i686-pc-linux-gnu-gcc  -c -g -O2  -DGC_LINUX_THREADS -D_GNU_SOURCE -D_REENTRANT -DUSE_MMAP -DUSE_MUNMAP conftest.c >&5
configure:4071: $? = 0
configure:4078: test -z "$ac_c_werror_flag" || test ! -s conftest.err
configure:4081: $? = 0
configure:4088: test -s conftest.o
configure:4091: $? = 0
configure:4111: result: none needed
configure:4140: checking for style of include used by make
configure:4168: result: GNU
configure:4196: checking dependency style of i686-pc-linux-gnu-gcc
configure:4286: result: gcc3
configure:4311: checking for i686-pc-linux-gnu-gcc
configure:4338: result: i686-pc-linux-gnu-gcc
configure:4616: checking for C compiler version
configure:4623: i686-pc-linux-gnu-gcc --version >&5
i686-pc-linux-gnu-gcc (GCC) 3.4.6 (Gentoo Hardened 3.4.6-r2, ssp-3.4.6-1.0, pie-8.7.10)
Copyright (C) 2006 Free Software Foundation, Inc.
This is free software; see the source for copying conditions.  There is NO
warranty; not even for MERCHANTABILITY or FITNESS FOR A PARTICULAR PURPOSE.

configure:4626: $? = 0
configure:4633: i686-pc-linux-gnu-gcc -v >&5
Reading specs from /usr/lib/gcc/i686-pc-linux-gnu/3.4.6/specs
Configured with: /var/tmp/portage/gcc-3.4.6-r2/work/gcc-3.4.6/configure --prefix=/usr --bindir=/usr/i686-pc-linux-gnu/gcc-bin/3.4.6 --includedir=/usr/lib/gcc/i686-pc-linux-gnu/3.4.6/include --datadir=/usr/share/gcc-data/i686-pc-linux-gnu/3.4.6 --mandir=/usr/share/gcc-data/i686-pc-linux-gnu/3.4.6/man --infodir=/usr/share/gcc-data/i686-pc-linux-gnu/3.4.6/info --with-gxx-include-dir=/usr/lib/gcc/i686-pc-linux-gnu/3.4.6/include/g++-v3 --host=i686-pc-linux-gnu --build=i686-pc-linux-gnu --disable-altivec --enable-nls --without-included-gettext --with-system-zlib --disable-checking --disable-werror --enable-secureplt --disable-libunwind-exceptions --disable-multilib --disable-libgcj --enable-languages=c,c++ --enable-shared --enable-threads=posix --enable-__cxa_atexit --enable-clocale=gnu
Thread model: posix
gcc version 3.4.6 (Gentoo Hardened 3.4.6-r2, ssp-3.4.6-1.0, pie-8.7.10)
configure:4636: $? = 0
configure:4643: i686-pc-linux-gnu-gcc -V >&5
i686-pc-linux-gnu-gcc: `-V' option must have argument
configure:4646: $? = 1
configure:4649: checking whether we are using the GNU C compiler
configure:4718: result: yes
configure:4723: checking whether i686-pc-linux-gnu-gcc accepts -g
configure:4909: result: yes
configure:4926: checking for i686-pc-linux-gnu-gcc option to accept ISO C89
configure:5046: result: none needed
configure:5066: checking dependency style of i686-pc-linux-gnu-gcc
configure:5156: result: gcc3
configure:5189: checking for a BSD-compatible install
configure:5245: result: /usr/bin/install -c
configure:5260: checking for gawk
configure:5287: result: gawk
configure:5306: checking for bison
configure:5322: found /usr/bin/bison
configure:5334: result: yes
configure:5380: checking how to run the C preprocessor
configure:5420: i686-pc-linux-gnu-gcc -E  -DGC_LINUX_THREADS -D_GNU_SOURCE -D_REENTRANT -DUSE_MMAP -DUSE_MUNMAP conftest.c
configure:5426: $? = 0
configure:5464: i686-pc-linux-gnu-gcc -E  -DGC_LINUX_THREADS -D_GNU_SOURCE -D_REENTRANT -DUSE_MMAP -DUSE_MUNMAP conftest.c
conftest.c:10:28: ac_nonexistent.h: No such file or directory
configure:5470: $? = 1
configure: failed program was:
| /* confdefs.h.  */
| #define PACKAGE_NAME ""
| #define PACKAGE_TARNAME ""
| #define PACKAGE_VERSION ""
| #define PACKAGE_STRING ""
| #define PACKAGE_BUGREPORT ""
| #define PACKAGE "mono"
| #define VERSION "1.2"
| /* end confdefs.h.  */
| #include <ac_nonexistent.h>
configure:5510: result: i686-pc-linux-gnu-gcc -E
configure:5539: i686-pc-linux-gnu-gcc -E  -DGC_LINUX_THREADS -D_GNU_SOURCE -D_REENTRANT -DUSE_MMAP -DUSE_MUNMAP conftest.c
configure:5545: $? = 0
configure:5583: i686-pc-linux-gnu-gcc -E  -DGC_LINUX_THREADS -D_GNU_SOURCE -D_REENTRANT -DUSE_MMAP -DUSE_MUNMAP conftest.c
conftest.c:10:28: ac_nonexistent.h: No such file or directory
configure:5589: $? = 1
configure: failed program was:
| /* confdefs.h.  */
| #define PACKAGE_NAME ""
| #define PACKAGE_TARNAME ""
| #define PACKAGE_VERSION ""
| #define PACKAGE_STRING ""
| #define PACKAGE_BUGREPORT ""
| #define PACKAGE "mono"
| #define VERSION "1.2"
| /* end confdefs.h.  */
| #include <ac_nonexistent.h>
configure:5634: checking for grep that handles long lines and -e
configure:5708: result: /bin/grep
configure:5713: checking for egrep
configure:5791: result: /bin/grep -E
configure:5796: checking for ANSI C header files
configure:5826: i686-pc-linux-gnu-gcc -c -g -O2  -DGC_LINUX_THREADS -D_GNU_SOURCE -D_REENTRANT -DUSE_MMAP -DUSE_MUNMAP conftest.c >&5
configure:5832: $? = 0
configure:5839: test -z "$ac_c_werror_flag" || test ! -s conftest.err
configure:5842: $? = 0
configure:5849: test -s conftest.o
configure:5852: $? = 0
configure:5948: i686-pc-linux-gnu-gcc -o conftest -g -O2  -DGC_LINUX_THREADS -D_GNU_SOURCE -D_REENTRANT -DUSE_MMAP -DUSE_MUNMAP  conftest.c  >&5
configure:5951: $? = 0
configure:5957: ./conftest
configure:5960: $? = 0
configure:5977: result: yes
configure:6063: checking for a sed that does not truncate output
configure:6117: result: /usr/bin/sed
configure:6131: checking for ld used by i686-pc-linux-gnu-gcc
configure:6198: result: /usr/i686-pc-linux-gnu/bin/ld
configure:6207: checking if the linker (/usr/i686-pc-linux-gnu/bin/ld) is GNU ld
configure:6222: result: yes
configure:6227: checking for /usr/i686-pc-linux-gnu/bin/ld option to reload object files
configure:6234: result: -r
configure:6252: checking for BSD-compatible nm
configure:6301: result: /usr/bin/nm -B
configure:6305: checking how to recognise dependent libraries
configure:6481: result: pass_all
configure:7029: checking for sys/types.h
configure:7050: i686-pc-linux-gnu-gcc -c -g -O2  -DGC_LINUX_THREADS -D_GNU_SOURCE -D_REENTRANT -DUSE_MMAP -DUSE_MUNMAP conftest.c >&5
configure:7056: $? = 0
configure:7063: test -z "$ac_c_werror_flag" || test ! -s conftest.err
configure:7066: $? = 0
configure:7073: test -s conftest.o
configure:7076: $? = 0
configure:7089: result: yes
configure:7029: checking for sys/stat.h
configure:7050: i686-pc-linux-gnu-gcc -c -g -O2  -DGC_LINUX_THREADS -D_GNU_SOURCE -D_REENTRANT -DUSE_MMAP -DUSE_MUNMAP conftest.c >&5
configure:7056: $? = 0
configure:7063: test -z "$ac_c_werror_flag" || test ! -s conftest.err
configure:7066: $? = 0
configure:7073: test -s conftest.o
configure:7076: $? = 0
configure:7089: result: yes
configure:7029: checking for stdlib.h
configure:7050: i686-pc-linux-gnu-gcc -c -g -O2  -DGC_LINUX_THREADS -D_GNU_SOURCE -D_REENTRANT -DUSE_MMAP -DUSE_MUNMAP conftest.c >&5
configure:7056: $? = 0
configure:7063: test -z "$ac_c_werror_flag" || test ! -s conftest.err
configure:7066: $? = 0
configure:7073: test -s conftest.o
configure:7076: $? = 0
configure:7089: result: yes
configure:7029: checking for string.h
configure:7050: i686-pc-linux-gnu-gcc -c -g -O2  -DGC_LINUX_THREADS -D_GNU_SOURCE -D_REENTRANT -DUSE_MMAP -DUSE_MUNMAP conftest.c >&5
configure:7056: $? = 0
configure:7063: test -z "$ac_c_werror_flag" || test ! -s conftest.err
configure:7066: $? = 0
configure:7073: test -s conftest.o
configure:7076: $? = 0
configure:7089: result: yes
configure:7029: checking for memory.h
configure:7050: i686-pc-linux-gnu-gcc -c -g -O2  -DGC_LINUX_THREADS -D_GNU_SOURCE -D_REENTRANT -DUSE_MMAP -DUSE_MUNMAP conftest.c >&5
configure:7056: $? = 0
configure:7063: test -z "$ac_c_werror_flag" || test ! -s conftest.err
configure:7066: $? = 0
configure:7073: test -s conftest.o
configure:7076: $? = 0
configure:7089: result: yes
configure:7029: checking for strings.h
configure:7050: i686-pc-linux-gnu-gcc -c -g -O2  -DGC_LINUX_THREADS -D_GNU_SOURCE -D_REENTRANT -DUSE_MMAP -DUSE_MUNMAP conftest.c >&5
configure:7056: $? = 0
configure:7063: test -z "$ac_c_werror_flag" || test ! -s conftest.err
configure:7066: $? = 0
configure:7073: test -s conftest.o
configure:7076: $? = 0
configure:7089: result: yes
configure:7029: checking for inttypes.h
configure:7050: i686-pc-linux-gnu-gcc -c -g -O2  -DGC_LINUX_THREADS -D_GNU_SOURCE -D_REENTRANT -DUSE_MMAP -DUSE_MUNMAP conftest.c >&5
configure:7056: $? = 0
configure:7063: test -z "$ac_c_werror_flag" || test ! -s conftest.err
configure:7066: $? = 0
configure:7073: test -s conftest.o
configure:7076: $? = 0
configure:7089: result: yes
configure:7029: checking for stdint.h
configure:7050: i686-pc-linux-gnu-gcc -c -g -O2  -DGC_LINUX_THREADS -D_GNU_SOURCE -D_REENTRANT -DUSE_MMAP -DUSE_MUNMAP conftest.c >&5
configure:7056: $? = 0
configure:7063: test -z "$ac_c_werror_flag" || test ! -s conftest.err
configure:7066: $? = 0
configure:7073: test -s conftest.o
configure:7076: $? = 0
configure:7089: result: yes
configure:7029: checking for unistd.h
configure:7050: i686-pc-linux-gnu-gcc -c -g -O2  -DGC_LINUX_THREADS -D_GNU_SOURCE -D_REENTRANT -DUSE_MMAP -DUSE_MUNMAP conftest.c >&5
configure:7056: $? = 0
configure:7063: test -z "$ac_c_werror_flag" || test ! -s conftest.err
configure:7066: $? = 0
configure:7073: test -s conftest.o
configure:7076: $? = 0
configure:7089: result: yes
configure:7116: checking dlfcn.h usability
configure:7133: i686-pc-linux-gnu-gcc -c -g -O2  -DGC_LINUX_THREADS -D_GNU_SOURCE -D_REENTRANT -DUSE_MMAP -DUSE_MUNMAP conftest.c >&5
configure:7139: $? = 0
configure:7146: test -z "$ac_c_werror_flag" || test ! -s conftest.err
configure:7149: $? = 0
configure:7156: test -s conftest.o
configure:7159: $? = 0
configure:7170: result: yes
configure:7174: checking dlfcn.h presence
configure:7189: i686-pc-linux-gnu-gcc -E  -DGC_LINUX_THREADS -D_GNU_SOURCE -D_REENTRANT -DUSE_MMAP -DUSE_MUNMAP conftest.c
configure:7195: $? = 0
configure:7216: result: yes
configure:7244: checking for dlfcn.h
configure:7252: result: yes
configure:7279: checking for i686-pc-linux-gnu-g++
configure:7295: found /usr/bin/i686-pc-linux-gnu-g++
configure:7306: result: i686-pc-linux-gnu-g++
configure:7381: checking for C++ compiler version
configure:7388: i686-pc-linux-gnu-g++ --version >&5
i686-pc-linux-gnu-g++ (GCC) 3.4.6 (Gentoo Hardened 3.4.6-r2, ssp-3.4.6-1.0, pie-8.7.10)
Copyright (C) 2006 Free Software Foundation, Inc.
This is free software; see the source for copying conditions.  There is NO
warranty; not even for MERCHANTABILITY or FITNESS FOR A PARTICULAR PURPOSE.

configure:7391: $? = 0
configure:7398: i686-pc-linux-gnu-g++ -v >&5
Reading specs from /usr/lib/gcc/i686-pc-linux-gnu/3.4.6/specs
Configured with: /var/tmp/portage/gcc-3.4.6-r2/work/gcc-3.4.6/configure --prefix=/usr --bindir=/usr/i686-pc-linux-gnu/gcc-bin/3.4.6 --includedir=/usr/lib/gcc/i686-pc-linux-gnu/3.4.6/include --datadir=/usr/share/gcc-data/i686-pc-linux-gnu/3.4.6 --mandir=/usr/share/gcc-data/i686-pc-linux-gnu/3.4.6/man --infodir=/usr/share/gcc-data/i686-pc-linux-gnu/3.4.6/info --with-gxx-include-dir=/usr/lib/gcc/i686-pc-linux-gnu/3.4.6/include/g++-v3 --host=i686-pc-linux-gnu --build=i686-pc-linux-gnu --disable-altivec --enable-nls --without-included-gettext --with-system-zlib --disable-checking --disable-werror --enable-secureplt --disable-libunwind-exceptions --disable-multilib --disable-libgcj --enable-languages=c,c++ --enable-shared --enable-threads=posix --enable-__cxa_atexit --enable-clocale=gnu
Thread model: posix
gcc version 3.4.6 (Gentoo Hardened 3.4.6-r2, ssp-3.4.6-1.0, pie-8.7.10)
configure:7401: $? = 0
configure:7408: i686-pc-linux-gnu-g++ -V >&5
i686-pc-linux-gnu-g++: `-V' option must have argument
configure:7411: $? = 1
configure:7414: checking whether we are using the GNU C++ compiler
configure:7443: i686-pc-linux-gnu-g++ -c   -DGC_LINUX_THREADS -D_GNU_SOURCE -D_REENTRANT -DUSE_MMAP -DUSE_MUNMAP conftest.cpp >&5
configure:7449: $? = 0
configure:7456: test -z "$ac_cxx_werror_flag" || test ! -s conftest.err
configure:7459: $? = 0
configure:7466: test -s conftest.o
configure:7469: $? = 0
configure:7483: result: yes
configure:7488: checking whether i686-pc-linux-gnu-g++ accepts -g
configure:7518: i686-pc-linux-gnu-g++ -c -g  -DGC_LINUX_THREADS -D_GNU_SOURCE -D_REENTRANT -DUSE_MMAP -DUSE_MUNMAP conftest.cpp >&5
configure:7524: $? = 0
configure:7531: test -z "$ac_cxx_werror_flag" || test ! -s conftest.err
configure:7534: $? = 0
configure:7541: test -s conftest.o
configure:7544: $? = 0
configure:7674: result: yes
configure:7699: checking dependency style of i686-pc-linux-gnu-g++
configure:7789: result: gcc3
configure:7816: checking how to run the C++ preprocessor
configure:7852: i686-pc-linux-gnu-g++ -E  -DGC_LINUX_THREADS -D_GNU_SOURCE -D_REENTRANT -DUSE_MMAP -DUSE_MUNMAP conftest.cpp
configure:7858: $? = 0
configure:7896: i686-pc-linux-gnu-g++ -E  -DGC_LINUX_THREADS -D_GNU_SOURCE -D_REENTRANT -DUSE_MMAP -DUSE_MUNMAP conftest.cpp
conftest.cpp:21:28: ac_nonexistent.h: No such file or directory
configure:7902: $? = 1
configure: failed program was:
| /* confdefs.h.  */
| #define PACKAGE_NAME ""
| #define PACKAGE_TARNAME ""
| #define PACKAGE_VERSION ""
| #define PACKAGE_STRING ""
| #define PACKAGE_BUGREPORT ""
| #define PACKAGE "mono"
| #define VERSION "1.2"
| #define STDC_HEADERS 1
| #define HAVE_SYS_TYPES_H 1
| #define HAVE_SYS_STAT_H 1
| #define HAVE_STDLIB_H 1
| #define HAVE_STRING_H 1
| #define HAVE_MEMORY_H 1
| #define HAVE_STRINGS_H 1
| #define HAVE_INTTYPES_H 1
| #define HAVE_STDINT_H 1
| #define HAVE_UNISTD_H 1
| #define HAVE_DLFCN_H 1
| /* end confdefs.h.  */
| #include <ac_nonexistent.h>
configure:7942: result: i686-pc-linux-gnu-g++ -E
configure:7971: i686-pc-linux-gnu-g++ -E  -DGC_LINUX_THREADS -D_GNU_SOURCE -D_REENTRANT -DUSE_MMAP -DUSE_MUNMAP conftest.cpp
configure:7977: $? = 0
configure:8015: i686-pc-linux-gnu-g++ -E  -DGC_LINUX_THREADS -D_GNU_SOURCE -D_REENTRANT -DUSE_MMAP -DUSE_MUNMAP conftest.cpp
conftest.cpp:21:28: ac_nonexistent.h: No such file or directory
configure:8021: $? = 1
configure: failed program was:
| /* confdefs.h.  */
| #define PACKAGE_NAME ""
| #define PACKAGE_TARNAME ""
| #define PACKAGE_VERSION ""
| #define PACKAGE_STRING ""
| #define PACKAGE_BUGREPORT ""
| #define PACKAGE "mono"
| #define VERSION "1.2"
| #define STDC_HEADERS 1
| #define HAVE_SYS_TYPES_H 1
| #define HAVE_SYS_STAT_H 1
| #define HAVE_STDLIB_H 1
| #define HAVE_STRING_H 1
| #define HAVE_MEMORY_H 1
| #define HAVE_STRINGS_H 1
| #define HAVE_INTTYPES_H 1
| #define HAVE_STDINT_H 1
| #define HAVE_UNISTD_H 1
| #define HAVE_DLFCN_H 1
| /* end confdefs.h.  */
| #include <ac_nonexistent.h>
configure:8077: checking for i686-pc-linux-gnu-g77
configure:8107: result: no
configure:8077: checking for i686-pc-linux-gnu-f77
configure:8107: result: no
configure:8077: checking for i686-pc-linux-gnu-xlf
configure:8107: result: no
configure:8077: checking for i686-pc-linux-gnu-frt
configure:8107: result: no
configure:8077: checking for i686-pc-linux-gnu-pgf77
configure:8107: result: no
configure:8077: checking for i686-pc-linux-gnu-cf77
configure:8107: result: no
configure:8077: checking for i686-pc-linux-gnu-fort77
configure:8107: result: no
configure:8077: checking for i686-pc-linux-gnu-fl32
configure:8107: result: no
configure:8077: checking for i686-pc-linux-gnu-af77
configure:8107: result: no
configure:8077: checking for i686-pc-linux-gnu-f90
configure:8107: result: no
configure:8077: checking for i686-pc-linux-gnu-xlf90
configure:8107: result: no
configure:8077: checking for i686-pc-linux-gnu-pgf90
configure:8107: result: no
configure:8077: checking for i686-pc-linux-gnu-pghpf
configure:8107: result: no
configure:8077: checking for i686-pc-linux-gnu-epcf90
configure:8107: result: no
configure:8077: checking for i686-pc-linux-gnu-gfortran
configure:8107: result: no
configure:8077: checking for i686-pc-linux-gnu-g95
configure:8107: result: no
configure:8077: checking for i686-pc-linux-gnu-f95
configure:8107: result: no
configure:8077: checking for i686-pc-linux-gnu-fort
configure:8107: result: no
configure:8077: checking for i686-pc-linux-gnu-xlf95
configure:8107: result: no
configure:8077: checking for i686-pc-linux-gnu-ifort
configure:8107: result: no
configure:8077: checking for i686-pc-linux-gnu-ifc
configure:8107: result: no
configure:8077: checking for i686-pc-linux-gnu-efc
configure:8107: result: no
configure:8077: checking for i686-pc-linux-gnu-pgf95
configure:8107: result: no
configure:8077: checking for i686-pc-linux-gnu-lf95
configure:8107: result: no
configure:8077: checking for i686-pc-linux-gnu-ftn
configure:8107: result: no
configure:8121: checking for g77
configure:8151: result: no
configure:8121: checking for f77
configure:8151: result: no
configure:8121: checking for xlf
configure:8151: result: no
configure:8121: checking for frt
configure:8151: result: no
configure:8121: checking for pgf77
configure:8151: result: no
configure:8121: checking for cf77
configure:8151: result: no
configure:8121: checking for fort77
configure:8151: result: no
configure:8121: checking for fl32
configure:8151: result: no
configure:8121: checking for af77
configure:8151: result: no
configure:8121: checking for f90
configure:8151: result: no
configure:8121: checking for xlf90
configure:8151: result: no
configure:8121: checking for pgf90
configure:8151: result: no
configure:8121: checking for pghpf
configure:8151: result: no
configure:8121: checking for epcf90
configure:8151: result: no
configure:8121: checking for gfortran
configure:8151: result: no
configure:8121: checking for g95
configure:8151: result: no
configure:8121: checking for f95
configure:8151: result: no
configure:8121: checking for fort
configure:8151: result: no
configure:8121: checking for xlf95
configure:8151: result: no
configure:8121: checking for ifort
configure:8151: result: no
configure:8121: checking for ifc
configure:8151: result: no
configure:8121: checking for efc
configure:8151: result: no
configure:8121: checking for pgf95
configure:8151: result: no
configure:8121: checking for lf95
configure:8151: result: no
configure:8121: checking for ftn
configure:8151: result: no
configure:8178: checking for Fortran 77 compiler version
configure:8185:  --version >&5
./configure: line 8186: --version: command not found
configure:8188: $? = 127
configure:8195:  -v >&5
./configure: line 8196: -v: command not found
configure:8198: $? = 127
configure:8205:  -V >&5
./configure: line 8206: -V: command not found
configure:8208: $? = 127
configure:8216: checking whether we are using the GNU Fortran 77 compiler
configure:8235:  -c  conftest.F >&5
./configure: line 8236: -c: command not found
configure:8241: $? = 127
configure: failed program was:
|       program main
| #ifndef __GNUC__
|        choke me
| #endif
| 
|       end
configure:8275: result: no
configure:8281: checking whether  accepts -g
configure:8298:  -c -g conftest.f >&5
./configure: line 8299: -c: command not found
configure:8304: $? = 127
configure: failed program was:
|       program main
| 
|       end
configure:8337: result: no
configure:8367: checking the maximum length of command line arguments
configure:8476: result: 32768
configure:8487: checking command to parse /usr/bin/nm -B output from i686-pc-linux-gnu-gcc object
configure:8592: i686-pc-linux-gnu-gcc -c -g -O2  -DGC_LINUX_THREADS -D_GNU_SOURCE -D_REENTRANT -DUSE_MMAP -DUSE_MUNMAP conftest.c >&5
configure:8595: $? = 0
configure:8599: /usr/bin/nm -B conftest.o \| sed -n -e 's/^.*[ 	]\([ABCDGIRSTW][ABCDGIRSTW]*\)[ 	][ 	]*\([_A-Za-z][_A-Za-z0-9]*\)$/\1 \2 \2/p' \> conftest.nm
configure:8602: $? = 0
configure:8654: i686-pc-linux-gnu-gcc -o conftest -g -O2  -DGC_LINUX_THREADS -D_GNU_SOURCE -D_REENTRANT -DUSE_MMAP -DUSE_MUNMAP  conftest.c conftstm.o >&5
configure:8657: $? = 0
configure:8695: result: ok
configure:8699: checking for objdir
configure:8714: result: .libs
configure:8766: checking for i686-pc-linux-gnu-ar
configure:8782: found /usr/bin/i686-pc-linux-gnu-ar
configure:8793: result: i686-pc-linux-gnu-ar
configure:8862: checking for i686-pc-linux-gnu-ranlib
configure:8878: found /usr/bin/i686-pc-linux-gnu-ranlib
configure:8889: result: i686-pc-linux-gnu-ranlib
configure:8958: checking for i686-pc-linux-gnu-strip
configure:8974: found /usr/bin/i686-pc-linux-gnu-strip
configure:8985: result: i686-pc-linux-gnu-strip
configure:9262: checking for correct ltmain.sh version
configure:9312: result: yes
configure:9372: checking if i686-pc-linux-gnu-gcc supports -fno-rtti -fno-exceptions
configure:9390: i686-pc-linux-gnu-gcc -c -g -O2  -DGC_LINUX_THREADS -D_GNU_SOURCE -D_REENTRANT -DUSE_MMAP -DUSE_MUNMAP -fno-rtti -fno-exceptions conftest.c >&5
cc1: warning: command line option "-fno-rtti" is valid for C++/ObjC++ but not for C
configure:9394: $? = 0
configure:9407: result: no
configure:9422: checking for i686-pc-linux-gnu-gcc option to produce PIC
configure:9632: result: -fPIC
configure:9640: checking if i686-pc-linux-gnu-gcc PIC flag -fPIC works
configure:9658: i686-pc-linux-gnu-gcc -c -g -O2  -DGC_LINUX_THREADS -D_GNU_SOURCE -D_REENTRANT -DUSE_MMAP -DUSE_MUNMAP -fPIC -DPIC conftest.c >&5
configure:9662: $? = 0
configure:9675: result: yes
configure:9703: checking if i686-pc-linux-gnu-gcc static flag -static works
configure:9731: result: yes
configure:9741: checking if i686-pc-linux-gnu-gcc supports -c -o file.o
configure:9762: i686-pc-linux-gnu-gcc -c -g -O2  -DGC_LINUX_THREADS -D_GNU_SOURCE -D_REENTRANT -DUSE_MMAP -DUSE_MUNMAP -o out/conftest2.o conftest.c >&5
configure:9766: $? = 0
configure:9788: result: yes
configure:9814: checking whether the i686-pc-linux-gnu-gcc linker (/usr/i686-pc-linux-gnu/bin/ld) supports shared libraries
configure:10800: result: yes
configure:10821: checking whether -lc should be explicitly linked in
configure:10826: i686-pc-linux-gnu-gcc -c -g -O2  -DGC_LINUX_THREADS -D_GNU_SOURCE -D_REENTRANT -DUSE_MMAP -DUSE_MUNMAP conftest.c >&5
configure:10829: $? = 0
configure:10844: i686-pc-linux-gnu-gcc -shared conftest.o  -v -Wl,-soname -Wl,conftest -o conftest 2\>\&1 \| grep  -lc  \>/dev/null 2\>\&1
configure:10847: $? = 0
configure:10859: result: no
configure:10867: checking dynamic linker characteristics
configure:11492: result: GNU/Linux ld.so
configure:11501: checking how to hardcode library paths into programs
configure:11526: result: immediate
configure:11540: checking whether stripping libraries is possible
configure:11545: result: yes
configure:12458: checking if libtool supports shared libraries
configure:12460: result: yes
configure:12463: checking whether to build shared libraries
configure:12484: result: yes
configure:12487: checking whether to build static libraries
configure:12491: result: yes
configure:12583: creating libtool
configure:13171: checking for ld used by i686-pc-linux-gnu-g++
configure:13238: result: /usr/i686-pc-linux-gnu/bin/ld
configure:13247: checking if the linker (/usr/i686-pc-linux-gnu/bin/ld) is GNU ld
configure:13262: result: yes
configure:13313: checking whether the i686-pc-linux-gnu-g++ linker (/usr/i686-pc-linux-gnu/bin/ld) supports shared libraries
configure:14279: result: yes
configure:14297: i686-pc-linux-gnu-g++ -c -g -O2  -DGC_LINUX_THREADS -D_GNU_SOURCE -D_REENTRANT -DUSE_MMAP -DUSE_MUNMAP conftest.cpp >&5
configure:14300: $? = 0
configure:14419: checking for i686-pc-linux-gnu-g++ option to produce PIC
configure:14693: result: -fPIC
configure:14701: checking if i686-pc-linux-gnu-g++ PIC flag -fPIC works
configure:14719: i686-pc-linux-gnu-g++ -c -g -O2  -DGC_LINUX_THREADS -D_GNU_SOURCE -D_REENTRANT -DUSE_MMAP -DUSE_MUNMAP -fPIC -DPIC conftest.cpp >&5
configure:14723: $? = 0
configure:14736: result: yes
configure:14764: checking if i686-pc-linux-gnu-g++ static flag -static works
configure:14792: result: yes
configure:14802: checking if i686-pc-linux-gnu-g++ supports -c -o file.o
configure:14823: i686-pc-linux-gnu-g++ -c -g -O2  -DGC_LINUX_THREADS -D_GNU_SOURCE -D_REENTRANT -DUSE_MMAP -DUSE_MUNMAP -o out/conftest2.o conftest.cpp >&5
configure:14827: $? = 0
configure:14849: result: yes
configure:14875: checking whether the i686-pc-linux-gnu-g++ linker (/usr/i686-pc-linux-gnu/bin/ld) supports shared libraries
configure:14900: result: yes
configure:14967: checking dynamic linker characteristics
configure:15592: result: GNU/Linux ld.so
configure:15601: checking how to hardcode library paths into programs
configure:15626: result: immediate
configure:21917: checking for ld used by i686-pc-linux-gnu-gcc
configure:21984: result: /usr/i686-pc-linux-gnu/bin/ld
configure:21993: checking if the linker (/usr/i686-pc-linux-gnu/bin/ld) is GNU ld
configure:22008: result: yes
configure:22013: checking if the linker (/usr/i686-pc-linux-gnu/bin/ld) is GNU ld
configure:22028: result: yes
configure:22069: checking sys/filio.h usability
configure:22086: i686-pc-linux-gnu-gcc -c -g -O2  -DGC_LINUX_THREADS -D_GNU_SOURCE -D_REENTRANT -DUSE_MMAP -DUSE_MUNMAP conftest.c >&5
conftest.c:54:23: sys/filio.h: No such file or directory
configure:22092: $? = 1
configure: failed program was:
| /* confdefs.h.  */
| #define PACKAGE_NAME ""
| #define PACKAGE_TARNAME ""
| #define PACKAGE_VERSION ""
| #define PACKAGE_STRING ""
| #define PACKAGE_BUGREPORT ""
| #define PACKAGE "mono"
| #define VERSION "1.2"
| #define STDC_HEADERS 1
| #define HAVE_SYS_TYPES_H 1
| #define HAVE_SYS_STAT_H 1
| #define HAVE_STDLIB_H 1
| #define HAVE_STRING_H 1
| #define HAVE_MEMORY_H 1
| #define HAVE_STRINGS_H 1
| #define HAVE_INTTYPES_H 1
| #define HAVE_STDINT_H 1
| #define HAVE_UNISTD_H 1
| #define HAVE_DLFCN_H 1
| /* end confdefs.h.  */
| #include <stdio.h>
| #if HAVE_SYS_TYPES_H
| # include <sys/types.h>
| #endif
| #if HAVE_SYS_STAT_H
| # include <sys/stat.h>
| #endif
| #if STDC_HEADERS
| # include <stdlib.h>
| # include <stddef.h>
| #else
| # if HAVE_STDLIB_H
| #  include <stdlib.h>
| # endif
| #endif
| #if HAVE_STRING_H
| # if !STDC_HEADERS && HAVE_MEMORY_H
| #  include <memory.h>
| # endif
| # include <string.h>
| #endif
| #if HAVE_STRINGS_H
| # include <strings.h>
| #endif
| #if HAVE_INTTYPES_H
| # include <inttypes.h>
| #endif
| #if HAVE_STDINT_H
| # include <stdint.h>
| #endif
| #if HAVE_UNISTD_H
| # include <unistd.h>
| #endif
| #include <sys/filio.h>
configure:22123: result: no
configure:22127: checking sys/filio.h presence
configure:22142: i686-pc-linux-gnu-gcc -E  -DGC_LINUX_THREADS -D_GNU_SOURCE -D_REENTRANT -DUSE_MMAP -DUSE_MUNMAP conftest.c
conftest.c:21:23: sys/filio.h: No such file or directory
configure:22148: $? = 1
configure: failed program was:
| /* confdefs.h.  */
| #define PACKAGE_NAME ""
| #define PACKAGE_TARNAME ""
| #define PACKAGE_VERSION ""
| #define PACKAGE_STRING ""
| #define PACKAGE_BUGREPORT ""
| #define PACKAGE "mono"
| #define VERSION "1.2"
| #define STDC_HEADERS 1
| #define HAVE_SYS_TYPES_H 1
| #define HAVE_SYS_STAT_H 1
| #define HAVE_STDLIB_H 1
| #define HAVE_STRING_H 1
| #define HAVE_MEMORY_H 1
| #define HAVE_STRINGS_H 1
| #define HAVE_INTTYPES_H 1
| #define HAVE_STDINT_H 1
| #define HAVE_UNISTD_H 1
| #define HAVE_DLFCN_H 1
| /* end confdefs.h.  */
| #include <sys/filio.h>
configure:22169: result: no
configure:22197: checking for sys/filio.h
configure:22205: result: no
configure:22069: checking sys/sockio.h usability
configure:22086: i686-pc-linux-gnu-gcc -c -g -O2  -DGC_LINUX_THREADS -D_GNU_SOURCE -D_REENTRANT -DUSE_MMAP -DUSE_MUNMAP conftest.c >&5
conftest.c:54:24: sys/sockio.h: No such file or directory
configure:22092: $? = 1
configure: failed program was:
| /* confdefs.h.  */
| #define PACKAGE_NAME ""
| #define PACKAGE_TARNAME ""
| #define PACKAGE_VERSION ""
| #define PACKAGE_STRING ""
| #define PACKAGE_BUGREPORT ""
| #define PACKAGE "mono"
| #define VERSION "1.2"
| #define STDC_HEADERS 1
| #define HAVE_SYS_TYPES_H 1
| #define HAVE_SYS_STAT_H 1
| #define HAVE_STDLIB_H 1
| #define HAVE_STRING_H 1
| #define HAVE_MEMORY_H 1
| #define HAVE_STRINGS_H 1
| #define HAVE_INTTYPES_H 1
| #define HAVE_STDINT_H 1
| #define HAVE_UNISTD_H 1
| #define HAVE_DLFCN_H 1
| /* end confdefs.h.  */
| #include <stdio.h>
| #if HAVE_SYS_TYPES_H
| # include <sys/types.h>
| #endif
| #if HAVE_SYS_STAT_H
| # include <sys/stat.h>
| #endif
| #if STDC_HEADERS
| # include <stdlib.h>
| # include <stddef.h>
| #else
| # if HAVE_STDLIB_H
| #  include <stdlib.h>
| # endif
| #endif
| #if HAVE_STRING_H
| # if !STDC_HEADERS && HAVE_MEMORY_H
| #  include <memory.h>
| # endif
| # include <string.h>
| #endif
| #if HAVE_STRINGS_H
| # include <strings.h>
| #endif
| #if HAVE_INTTYPES_H
| # include <inttypes.h>
| #endif
| #if HAVE_STDINT_H
| # include <stdint.h>
| #endif
| #if HAVE_UNISTD_H
| # include <unistd.h>
| #endif
| #include <sys/sockio.h>
configure:22123: result: no
configure:22127: checking sys/sockio.h presence
configure:22142: i686-pc-linux-gnu-gcc -E  -DGC_LINUX_THREADS -D_GNU_SOURCE -D_REENTRANT -DUSE_MMAP -DUSE_MUNMAP conftest.c
conftest.c:21:24: sys/sockio.h: No such file or directory
configure:22148: $? = 1
configure: failed program was:
| /* confdefs.h.  */
| #define PACKAGE_NAME ""
| #define PACKAGE_TARNAME ""
| #define PACKAGE_VERSION ""
| #define PACKAGE_STRING ""
| #define PACKAGE_BUGREPORT ""
| #define PACKAGE "mono"
| #define VERSION "1.2"
| #define STDC_HEADERS 1
| #define HAVE_SYS_TYPES_H 1
| #define HAVE_SYS_STAT_H 1
| #define HAVE_STDLIB_H 1
| #define HAVE_STRING_H 1
| #define HAVE_MEMORY_H 1
| #define HAVE_STRINGS_H 1
| #define HAVE_INTTYPES_H 1
| #define HAVE_STDINT_H 1
| #define HAVE_UNISTD_H 1
| #define HAVE_DLFCN_H 1
| /* end confdefs.h.  */
| #include <sys/sockio.h>
configure:22169: result: no
configure:22197: checking for sys/sockio.h
configure:22205: result: no
configure:22069: checking netdb.h usability
configure:22086: i686-pc-linux-gnu-gcc -c -g -O2  -DGC_LINUX_THREADS -D_GNU_SOURCE -D_REENTRANT -DUSE_MMAP -DUSE_MUNMAP conftest.c >&5
configure:22092: $? = 0
configure:22099: test -z "$ac_c_werror_flag" || test ! -s conftest.err
configure:22102: $? = 0
configure:22109: test -s conftest.o
configure:22112: $? = 0
configure:22123: result: yes
configure:22127: checking netdb.h presence
configure:22142: i686-pc-linux-gnu-gcc -E  -DGC_LINUX_THREADS -D_GNU_SOURCE -D_REENTRANT -DUSE_MMAP -DUSE_MUNMAP conftest.c
configure:22148: $? = 0
configure:22169: result: yes
configure:22197: checking for netdb.h
configure:22205: result: yes
configure:22069: checking utime.h usability
configure:22086: i686-pc-linux-gnu-gcc -c -g -O2  -DGC_LINUX_THREADS -D_GNU_SOURCE -D_REENTRANT -DUSE_MMAP -DUSE_MUNMAP conftest.c >&5
configure:22092: $? = 0
configure:22099: test -z "$ac_c_werror_flag" || test ! -s conftest.err
configure:22102: $? = 0
configure:22109: test -s conftest.o
configure:22112: $? = 0
configure:22123: result: yes
configure:22127: checking utime.h presence
configure:22142: i686-pc-linux-gnu-gcc -E  -DGC_LINUX_THREADS -D_GNU_SOURCE -D_REENTRANT -DUSE_MMAP -DUSE_MUNMAP conftest.c
configure:22148: $? = 0
configure:22169: result: yes
configure:22197: checking for utime.h
configure:22205: result: yes
configure:22069: checking semaphore.h usability
configure:22086: i686-pc-linux-gnu-gcc -c -g -O2  -DGC_LINUX_THREADS -D_GNU_SOURCE -D_REENTRANT -DUSE_MMAP -DUSE_MUNMAP conftest.c >&5
configure:22092: $? = 0
configure:22099: test -z "$ac_c_werror_flag" || test ! -s conftest.err
configure:22102: $? = 0
configure:22109: test -s conftest.o
configure:22112: $? = 0
configure:22123: result: yes
configure:22127: checking semaphore.h presence
configure:22142: i686-pc-linux-gnu-gcc -E  -DGC_LINUX_THREADS -D_GNU_SOURCE -D_REENTRANT -DUSE_MMAP -DUSE_MUNMAP conftest.c
configure:22148: $? = 0
configure:22169: result: yes
configure:22197: checking for semaphore.h
configure:22205: result: yes
configure:22069: checking sys/un.h usability
configure:22086: i686-pc-linux-gnu-gcc -c -g -O2  -DGC_LINUX_THREADS -D_GNU_SOURCE -D_REENTRANT -DUSE_MMAP -DUSE_MUNMAP conftest.c >&5
configure:22092: $? = 0
configure:22099: test -z "$ac_c_werror_flag" || test ! -s conftest.err
configure:22102: $? = 0
configure:22109: test -s conftest.o
configure:22112: $? = 0
configure:22123: result: yes
configure:22127: checking sys/un.h presence
configure:22142: i686-pc-linux-gnu-gcc -E  -DGC_LINUX_THREADS -D_GNU_SOURCE -D_REENTRANT -DUSE_MMAP -DUSE_MUNMAP conftest.c
configure:22148: $? = 0
configure:22169: result: yes
configure:22197: checking for sys/un.h
configure:22205: result: yes
configure:22069: checking linux/rtc.h usability
configure:22086: i686-pc-linux-gnu-gcc -c -g -O2  -DGC_LINUX_THREADS -D_GNU_SOURCE -D_REENTRANT -DUSE_MMAP -DUSE_MUNMAP conftest.c >&5
configure:22092: $? = 0
configure:22099: test -z "$ac_c_werror_flag" || test ! -s conftest.err
configure:22102: $? = 0
configure:22109: test -s conftest.o
configure:22112: $? = 0
configure:22123: result: yes
configure:22127: checking linux/rtc.h presence
configure:22142: i686-pc-linux-gnu-gcc -E  -DGC_LINUX_THREADS -D_GNU_SOURCE -D_REENTRANT -DUSE_MMAP -DUSE_MUNMAP conftest.c
configure:22148: $? = 0
configure:22169: result: yes
configure:22197: checking for linux/rtc.h
configure:22205: result: yes
configure:22069: checking sys/syscall.h usability
configure:22086: i686-pc-linux-gnu-gcc -c -g -O2  -DGC_LINUX_THREADS -D_GNU_SOURCE -D_REENTRANT -DUSE_MMAP -DUSE_MUNMAP conftest.c >&5
configure:22092: $? = 0
configure:22099: test -z "$ac_c_werror_flag" || test ! -s conftest.err
configure:22102: $? = 0
configure:22109: test -s conftest.o
configure:22112: $? = 0
configure:22123: result: yes
configure:22127: checking sys/syscall.h presence
configure:22142: i686-pc-linux-gnu-gcc -E  -DGC_LINUX_THREADS -D_GNU_SOURCE -D_REENTRANT -DUSE_MMAP -DUSE_MUNMAP conftest.c
configure:22148: $? = 0
configure:22169: result: yes
configure:22197: checking for sys/syscall.h
configure:22205: result: yes
configure:22229: checking zlib.h usability
configure:22246: i686-pc-linux-gnu-gcc -c -g -O2  -DGC_LINUX_THREADS -D_GNU_SOURCE -D_REENTRANT -DUSE_MMAP -DUSE_MUNMAP conftest.c >&5
configure:22252: $? = 0
configure:22259: test -z "$ac_c_werror_flag" || test ! -s conftest.err
configure:22262: $? = 0
configure:22269: test -s conftest.o
configure:22272: $? = 0
configure:22283: result: yes
configure:22287: checking zlib.h presence
configure:22302: i686-pc-linux-gnu-gcc -E  -DGC_LINUX_THREADS -D_GNU_SOURCE -D_REENTRANT -DUSE_MMAP -DUSE_MUNMAP conftest.c
configure:22308: $? = 0
configure:22329: result: yes
configure:22357: checking for zlib.h
configure:22364: result: yes
configure:22403: checking elf.h usability
configure:22420: i686-pc-linux-gnu-gcc -c -g -O2  -DGC_LINUX_THREADS -D_GNU_SOURCE -D_REENTRANT -DUSE_MMAP -DUSE_MUNMAP conftest.c >&5
configure:22426: $? = 0
configure:22433: test -z "$ac_c_werror_flag" || test ! -s conftest.err
configure:22436: $? = 0
configure:22443: test -s conftest.o
configure:22446: $? = 0
configure:22457: result: yes
configure:22461: checking elf.h presence
configure:22476: i686-pc-linux-gnu-gcc -E  -DGC_LINUX_THREADS -D_GNU_SOURCE -D_REENTRANT -DUSE_MMAP -DUSE_MUNMAP conftest.c
configure:22482: $? = 0
configure:22503: result: yes
configure:22531: checking for elf.h
configure:22539: result: yes
configure:22569: checking poll.h usability
configure:22586: i686-pc-linux-gnu-gcc -c -g -O2  -DGC_LINUX_THREADS -D_GNU_SOURCE -D_REENTRANT -DUSE_MMAP -DUSE_MUNMAP conftest.c >&5
configure:22592: $? = 0
configure:22599: test -z "$ac_c_werror_flag" || test ! -s conftest.err
configure:22602: $? = 0
configure:22609: test -s conftest.o
configure:22612: $? = 0
configure:22623: result: yes
configure:22627: checking poll.h presence
configure:22642: i686-pc-linux-gnu-gcc -E  -DGC_LINUX_THREADS -D_GNU_SOURCE -D_REENTRANT -DUSE_MMAP -DUSE_MUNMAP conftest.c
configure:22648: $? = 0
configure:22669: result: yes
configure:22697: checking for poll.h
configure:22705: result: yes
configure:22733: checking sys/poll.h usability
configure:22750: i686-pc-linux-gnu-gcc -c -g -O2  -DGC_LINUX_THREADS -D_GNU_SOURCE -D_REENTRANT -DUSE_MMAP -DUSE_MUNMAP conftest.c >&5
configure:22756: $? = 0
configure:22763: test -z "$ac_c_werror_flag" || test ! -s conftest.err
configure:22766: $? = 0
configure:22773: test -s conftest.o
configure:22776: $? = 0
configure:22787: result: yes
configure:22791: checking sys/poll.h presence
configure:22806: i686-pc-linux-gnu-gcc -E  -DGC_LINUX_THREADS -D_GNU_SOURCE -D_REENTRANT -DUSE_MMAP -DUSE_MUNMAP conftest.c
configure:22812: $? = 0
configure:22833: result: yes
configure:22861: checking for sys/poll.h
configure:22869: result: yes
configure:22897: checking sys/wait.h usability
configure:22914: i686-pc-linux-gnu-gcc -c -g -O2  -DGC_LINUX_THREADS -D_GNU_SOURCE -D_REENTRANT -DUSE_MMAP -DUSE_MUNMAP conftest.c >&5
configure:22920: $? = 0
configure:22927: test -z "$ac_c_werror_flag" || test ! -s conftest.err
configure:22930: $? = 0
configure:22937: test -s conftest.o
configure:22940: $? = 0
configure:22951: result: yes
configure:22955: checking sys/wait.h presence
configure:22970: i686-pc-linux-gnu-gcc -E  -DGC_LINUX_THREADS -D_GNU_SOURCE -D_REENTRANT -DUSE_MMAP -DUSE_MUNMAP conftest.c
configure:22976: $? = 0
configure:22997: result: yes
configure:23025: checking for sys/wait.h
configure:23033: result: yes
configure:23061: checking grp.h usability
configure:23078: i686-pc-linux-gnu-gcc -c -g -O2  -DGC_LINUX_THREADS -D_GNU_SOURCE -D_REENTRANT -DUSE_MMAP -DUSE_MUNMAP conftest.c >&5
configure:23084: $? = 0
configure:23091: test -z "$ac_c_werror_flag" || test ! -s conftest.err
configure:23094: $? = 0
configure:23101: test -s conftest.o
configure:23104: $? = 0
configure:23115: result: yes
configure:23119: checking grp.h presence
configure:23134: i686-pc-linux-gnu-gcc -E  -DGC_LINUX_THREADS -D_GNU_SOURCE -D_REENTRANT -DUSE_MMAP -DUSE_MUNMAP conftest.c
configure:23140: $? = 0
configure:23161: result: yes
configure:23189: checking for grp.h
configure:23197: result: yes
configure:23225: checking syslog.h usability
configure:23242: i686-pc-linux-gnu-gcc -c -g -O2  -DGC_LINUX_THREADS -D_GNU_SOURCE -D_REENTRANT -DUSE_MMAP -DUSE_MUNMAP conftest.c >&5
configure:23248: $? = 0
configure:23255: test -z "$ac_c_werror_flag" || test ! -s conftest.err
configure:23258: $? = 0
configure:23265: test -s conftest.o
configure:23268: $? = 0
configure:23279: result: yes
configure:23283: checking syslog.h presence
configure:23298: i686-pc-linux-gnu-gcc -E  -DGC_LINUX_THREADS -D_GNU_SOURCE -D_REENTRANT -DUSE_MMAP -DUSE_MUNMAP conftest.c
configure:23304: $? = 0
configure:23325: result: yes
configure:23353: checking for syslog.h
configure:23361: result: yes
configure:23391: checking wchar.h usability
configure:23408: i686-pc-linux-gnu-gcc -c -g -O2  -DGC_LINUX_THREADS -D_GNU_SOURCE -D_REENTRANT -DUSE_MMAP -DUSE_MUNMAP conftest.c >&5
configure:23414: $? = 0
configure:23421: test -z "$ac_c_werror_flag" || test ! -s conftest.err
configure:23424: $? = 0
configure:23431: test -s conftest.o
configure:23434: $? = 0
configure:23445: result: yes
configure:23449: checking wchar.h presence
configure:23464: i686-pc-linux-gnu-gcc -E  -DGC_LINUX_THREADS -D_GNU_SOURCE -D_REENTRANT -DUSE_MMAP -DUSE_MUNMAP conftest.c
configure:23470: $? = 0
configure:23491: result: yes
configure:23519: checking for wchar.h
configure:23527: result: yes
configure:23726: checking ieeefp.h usability
configure:23743: i686-pc-linux-gnu-gcc -c -g -O2  -DGC_LINUX_THREADS -D_GNU_SOURCE -D_REENTRANT -DUSE_MMAP -DUSE_MUNMAP conftest.c >&5
conftest.c:67:20: ieeefp.h: No such file or directory
configure:23749: $? = 1
configure: failed program was:
| /* confdefs.h.  */
| #define PACKAGE_NAME ""
| #define PACKAGE_TARNAME ""
| #define PACKAGE_VERSION ""
| #define PACKAGE_STRING ""
| #define PACKAGE_BUGREPORT ""
| #define PACKAGE "mono"
| #define VERSION "1.2"
| #define STDC_HEADERS 1
| #define HAVE_SYS_TYPES_H 1
| #define HAVE_SYS_STAT_H 1
| #define HAVE_STDLIB_H 1
| #define HAVE_STRING_H 1
| #define HAVE_MEMORY_H 1
| #define HAVE_STRINGS_H 1
| #define HAVE_INTTYPES_H 1
| #define HAVE_STDINT_H 1
| #define HAVE_UNISTD_H 1
| #define HAVE_DLFCN_H 1
| #define HAVE_NETDB_H 1
| #define HAVE_UTIME_H 1
| #define HAVE_SEMAPHORE_H 1
| #define HAVE_SYS_UN_H 1
| #define HAVE_LINUX_RTC_H 1
| #define HAVE_SYS_SYSCALL_H 1
| #define HAVE_ELF_H 1
| #define HAVE_POLL_H 1
| #define HAVE_SYS_POLL_H 1
| #define HAVE_SYS_WAIT_H 1
| #define HAVE_GRP_H 1
| #define HAVE_SYSLOG_H 1
| #define HAVE_WCHAR_H 1
| /* end confdefs.h.  */
| #include <stdio.h>
| #if HAVE_SYS_TYPES_H
| # include <sys/types.h>
| #endif
| #if HAVE_SYS_STAT_H
| # include <sys/stat.h>
| #endif
| #if STDC_HEADERS
| # include <stdlib.h>
| # include <stddef.h>
| #else
| # if HAVE_STDLIB_H
| #  include <stdlib.h>
| # endif
| #endif
| #if HAVE_STRING_H
| # if !STDC_HEADERS && HAVE_MEMORY_H
| #  include <memory.h>
| # endif
| # include <string.h>
| #endif
| #if HAVE_STRINGS_H
| # include <strings.h>
| #endif
| #if HAVE_INTTYPES_H
| # include <inttypes.h>
| #endif
| #if HAVE_STDINT_H
| # include <stdint.h>
| #endif
| #if HAVE_UNISTD_H
| # include <unistd.h>
| #endif
| #include <ieeefp.h>
configure:23780: result: no
configure:23784: checking ieeefp.h presence
configure:23799: i686-pc-linux-gnu-gcc -E  -DGC_LINUX_THREADS -D_GNU_SOURCE -D_REENTRANT -DUSE_MMAP -DUSE_MUNMAP conftest.c
conftest.c:34:20: ieeefp.h: No such file or directory
configure:23805: $? = 1
configure: failed program was:
| /* confdefs.h.  */
| #define PACKAGE_NAME ""
| #define PACKAGE_TARNAME ""
| #define PACKAGE_VERSION ""
| #define PACKAGE_STRING ""
| #define PACKAGE_BUGREPORT ""
| #define PACKAGE "mono"
| #define VERSION "1.2"
| #define STDC_HEADERS 1
| #define HAVE_SYS_TYPES_H 1
| #define HAVE_SYS_STAT_H 1
| #define HAVE_STDLIB_H 1
| #define HAVE_STRING_H 1
| #define HAVE_MEMORY_H 1
| #define HAVE_STRINGS_H 1
| #define HAVE_INTTYPES_H 1
| #define HAVE_STDINT_H 1
| #define HAVE_UNISTD_H 1
| #define HAVE_DLFCN_H 1
| #define HAVE_NETDB_H 1
| #define HAVE_UTIME_H 1
| #define HAVE_SEMAPHORE_H 1
| #define HAVE_SYS_UN_H 1
| #define HAVE_LINUX_RTC_H 1
| #define HAVE_SYS_SYSCALL_H 1
| #define HAVE_ELF_H 1
| #define HAVE_POLL_H 1
| #define HAVE_SYS_POLL_H 1
| #define HAVE_SYS_WAIT_H 1
| #define HAVE_GRP_H 1
| #define HAVE_SYSLOG_H 1
| #define HAVE_WCHAR_H 1
| /* end confdefs.h.  */
| #include <ieeefp.h>
configure:23826: result: no
configure:23854: checking for ieeefp.h
configure:23862: result: no
configure:23877: checking for isinf
configure:23902: i686-pc-linux-gnu-gcc -o conftest -g -O2  -DGC_LINUX_THREADS -D_GNU_SOURCE -D_REENTRANT -DUSE_MMAP -DUSE_MUNMAP  conftest.c  >&5
configure:23908: $? = 0
configure:23915: test -z "$ac_c_werror_flag" || test ! -s conftest.err
configure:23918: $? = 0
configure:23925: test -s conftest
configure:23928: $? = 0
configure:23931: result: yes
configure:23955: checking for void *
configure:23985: i686-pc-linux-gnu-gcc -c -g -O2  -DGC_LINUX_THREADS -D_GNU_SOURCE -D_REENTRANT -DUSE_MMAP -DUSE_MUNMAP conftest.c >&5
configure:23991: $? = 0
configure:23998: test -z "$ac_c_werror_flag" || test ! -s conftest.err
configure:24001: $? = 0
configure:24008: test -s conftest.o
configure:24011: $? = 0
configure:24023: result: yes
configure:24026: checking size of void *
configure:24414: i686-pc-linux-gnu-gcc -o conftest -g -O2  -DGC_LINUX_THREADS -D_GNU_SOURCE -D_REENTRANT -DUSE_MMAP -DUSE_MUNMAP  conftest.c  >&5
configure:24417: $? = 0
configure:24423: ./conftest
configure:24426: $? = 0
configure:24448: result: 4
configure:24464: checking for -Wdeclaration-after-statement option to gcc
configure:24489: i686-pc-linux-gnu-gcc -c -g -O2 -fno-strict-aliasing -Wdeclaration-after-statement  -DGC_LINUX_THREADS -D_GNU_SOURCE -D_REENTRANT -DUSE_MMAP -DUSE_MUNMAP conftest.c >&5
conftest.c: In function `main':
conftest.c:41: warning: return type of 'main' is not `int'
configure:24495: $? = 0
configure:24502: test -z "$ac_c_werror_flag" || test ! -s conftest.err
configure:24505: $? = 0
configure:24512: test -s conftest.o
configure:24515: $? = 0
configure:24518: result: yes
configure:24588: checking for pkg-config
configure:24606: found /usr/bin/pkg-config
configure:24619: result: /usr/bin/pkg-config
configure:24681: checking for i686-pc-linux-gnu-pkg-config
configure:24711: result: /usr/bin/pkg-config
configure:24783: checking pkg-config is at least version 0.9.0
configure:24786: result: yes
configure:24797: checking for BASE_DEPENDENCIES
configure:24805: $PKG_CONFIG --exists --print-errors "glib-2.0 >= $GLIB_REQUIRED_VERSION"
configure:24808: $? = 0
configure:24823: $PKG_CONFIG --exists --print-errors "glib-2.0 >= $GLIB_REQUIRED_VERSION"
configure:24826: $? = 0
configure:24902: result: yes
configure:25049: checking for -mno-tls-direct-seg-refs option to gcc
configure:25074: i686-pc-linux-gnu-gcc -c -g -O2 -fno-strict-aliasing -Wdeclaration-after-statement -g -Wall -Wunused -Wmissing-prototypes -Wmissing-declarations -Wstrict-prototypes  -Wmissing-prototypes -Wnested-externs -Wpointer-arith -Wno-cast-qual -Wcast-align -Wwrite-strings -mno-tls-direct-seg-refs  -DGC_LINUX_THREADS -D_GNU_SOURCE -D_REENTRANT -DUSE_MMAP -DUSE_MUNMAP conftest.c >&5
conftest.c:40: warning: function declaration isn't a prototype
conftest.c: In function `main':
conftest.c:42: warning: function declaration isn't a prototype
conftest.c:42: warning: return type of 'main' is not `int'
conftest.c:42: warning: 'main' is normally a non-static function
configure:25080: $? = 0
configure:25087: test -z "$ac_c_werror_flag" || test ! -s conftest.err
configure:25090: $? = 0
configure:25097: test -s conftest.o
configure:25100: $? = 0
configure:25103: result: yes
configure:25230: checking for visibility __attribute__
configure:25256: i686-pc-linux-gnu-gcc -c -g -O2 -fno-strict-aliasing -Wdeclaration-after-statement -g -Wall -Wunused -Wmissing-prototypes -Wmissing-declarations -Wstrict-prototypes  -Wmissing-prototypes -Wnested-externs -Wpointer-arith -Wno-cast-qual -Wcast-align -Wwrite-strings -mno-tls-direct-seg-refs  -DGC_LINUX_THREADS -D_GNU_SOURCE -D_REENTRANT -DUSE_MMAP -DUSE_MUNMAP conftest.c >&5
conftest.c:41: warning: function declaration isn't a prototype
conftest.c: In function `main':
conftest.c:43: warning: no previous prototype for 'doit'
conftest.c:44: warning: function declaration isn't a prototype
conftest.c:44: warning: return type of 'main' is not `int'
conftest.c:44: warning: 'main' is normally a non-static function
configure:25262: $? = 0
configure:25269: test -z "$ac_c_werror_flag" || test ! -s conftest.err
configure:25272: $? = 0
configure:25279: test -s conftest.o
configure:25282: $? = 0
configure:25286: result: yes
configure:25892: checking for dlopen
configure:25948: i686-pc-linux-gnu-gcc -o conftest -g -O2 -fno-strict-aliasing -Wdeclaration-after-statement -g -Wall -Wunused -Wmissing-prototypes -Wmissing-declarations -Wstrict-prototypes  -Wmissing-prototypes -Wnested-externs -Wpointer-arith -Wno-cast-qual -Wcast-align -Wwrite-strings -mno-tls-direct-seg-refs  -DGC_LINUX_THREADS -D_GNU_SOURCE -D_REENTRANT -DUSE_MMAP -DUSE_MUNMAP  conftest.c  >&5
conftest.c:67: warning: function declaration isn't a prototype
conftest.c:77: warning: function declaration isn't a prototype
/tmp/ccc8ksIF.o: In function `main':
/usr/local/src/mono/conftest.c:78: undefined reference to `dlopen'
collect2: ld returned 1 exit status
configure:25954: $? = 1
configure: failed program was:
| /* confdefs.h.  */
| #define PACKAGE_NAME ""
| #define PACKAGE_TARNAME ""
| #define PACKAGE_VERSION ""
| #define PACKAGE_STRING ""
| #define PACKAGE_BUGREPORT ""
| #define PACKAGE "mono"
| #define VERSION "1.2"
| #define STDC_HEADERS 1
| #define HAVE_SYS_TYPES_H 1
| #define HAVE_SYS_STAT_H 1
| #define HAVE_STDLIB_H 1
| #define HAVE_STRING_H 1
| #define HAVE_MEMORY_H 1
| #define HAVE_STRINGS_H 1
| #define HAVE_INTTYPES_H 1
| #define HAVE_STDINT_H 1
| #define HAVE_UNISTD_H 1
| #define HAVE_DLFCN_H 1
| #define HAVE_NETDB_H 1
| #define HAVE_UTIME_H 1
| #define HAVE_SEMAPHORE_H 1
| #define HAVE_SYS_UN_H 1
| #define HAVE_LINUX_RTC_H 1
| #define HAVE_SYS_SYSCALL_H 1
| #define HAVE_ELF_H 1
| #define HAVE_POLL_H 1
| #define HAVE_SYS_POLL_H 1
| #define HAVE_SYS_WAIT_H 1
| #define HAVE_GRP_H 1
| #define HAVE_SYSLOG_H 1
| #define HAVE_WCHAR_H 1
| #define HAVE_ISINF 1
| #define SIZEOF_VOID_P 4
| #define MONO_XEN_OPT 1
| #define DISABLED_FEATURES "none"
| #define HAVE_BOEHM_GC 1
| #define HAVE_GC_H 1
| #define USE_INCLUDED_LIBGC 1
| #define HAVE_GC_GCJ_MALLOC 1
| #define HAVE_GC_ENABLE 1
| #define USED_GC_NAME "Included Boehm (with typed GC)"
| /* end confdefs.h.  */
| /* Define dlopen to an innocuous variant, in case <limits.h> declares dlopen.
|    For example, HP-UX 11i <limits.h> declares gettimeofday.  */
| #define dlopen innocuous_dlopen
| 
| /* System header to define __stub macros and hopefully few prototypes,
|     which can conflict with char dlopen (); below.
|     Prefer <limits.h> to <assert.h> if __STDC__ is defined, since
|     <limits.h> exists even on freestanding compilers.  */
| 
| #ifdef __STDC__
| # include <limits.h>
| #else
| # include <assert.h>
| #endif
| 
| #undef dlopen
| 
| /* Override any GCC internal prototype to avoid an error.
|    Use char because int might match the return type of a GCC
|    builtin and then its argument prototype would still apply.  */
| #ifdef __cplusplus
| extern "C"
| #endif
| char dlopen ();
| /* The GNU C library defines this for functions which it implements
|     to always fail with ENOSYS.  Some functions are actually named
|     something starting with __ and the normal name is an alias.  */
| #if defined __stub_dlopen || defined __stub___dlopen
| choke me
| #endif
| 
| int
| main ()
| {
| return dlopen ();
|   ;
|   return 0;
| }
configure:25987: result: no
configure:25992: checking for dlopen in -ldl
configure:26027: i686-pc-linux-gnu-gcc -o conftest -g -O2 -fno-strict-aliasing -Wdeclaration-after-statement -g -Wall -Wunused -Wmissing-prototypes -Wmissing-declarations -Wstrict-prototypes  -Wmissing-prototypes -Wnested-externs -Wpointer-arith -Wno-cast-qual -Wcast-align -Wwrite-strings -mno-tls-direct-seg-refs  -DGC_LINUX_THREADS -D_GNU_SOURCE -D_REENTRANT -DUSE_MMAP -DUSE_MUNMAP  conftest.c -ldl   >&5
conftest.c:51: warning: function declaration isn't a prototype
conftest.c:54: warning: function declaration isn't a prototype
configure:26033: $? = 0
configure:26040: test -z "$ac_c_werror_flag" || test ! -s conftest.err
configure:26043: $? = 0
configure:26050: test -s conftest
configure:26053: $? = 0
configure:26067: result: yes
configure:26088: checking for preceeding underscore in symbols
configure:26124: i686-pc-linux-gnu-gcc -o conftest -g -O2 -fno-strict-aliasing -Wdeclaration-after-statement -g -Wall -Wunused -Wmissing-prototypes -Wmissing-declarations -Wstrict-prototypes  -Wmissing-prototypes -Wnested-externs -Wpointer-arith -Wno-cast-qual -Wcast-align -Wwrite-strings -mno-tls-direct-seg-refs  -DGC_LINUX_THREADS -D_GNU_SOURCE -D_REENTRANT -DUSE_MMAP -DUSE_MUNMAP  conftest.c  -ldl >&5
conftest.c:46: warning: no previous prototype for 'mono_underscore_test'
conftest.c:47: warning: function declaration isn't a prototype
configure:26127: $? = 0
configure:26133: ./conftest
configure:26136: $? = 1
configure: program exited with status 1
configure: failed program was:
| /* confdefs.h.  */
| #define PACKAGE_NAME ""
| #define PACKAGE_TARNAME ""
| #define PACKAGE_VERSION ""
| #define PACKAGE_STRING ""
| #define PACKAGE_BUGREPORT ""
| #define PACKAGE "mono"
| #define VERSION "1.2"
| #define STDC_HEADERS 1
| #define HAVE_SYS_TYPES_H 1
| #define HAVE_SYS_STAT_H 1
| #define HAVE_STDLIB_H 1
| #define HAVE_STRING_H 1
| #define HAVE_MEMORY_H 1
| #define HAVE_STRINGS_H 1
| #define HAVE_INTTYPES_H 1
| #define HAVE_STDINT_H 1
| #define HAVE_UNISTD_H 1
| #define HAVE_DLFCN_H 1
| #define HAVE_NETDB_H 1
| #define HAVE_UTIME_H 1
| #define HAVE_SEMAPHORE_H 1
| #define HAVE_SYS_UN_H 1
| #define HAVE_LINUX_RTC_H 1
| #define HAVE_SYS_SYSCALL_H 1
| #define HAVE_ELF_H 1
| #define HAVE_POLL_H 1
| #define HAVE_SYS_POLL_H 1
| #define HAVE_SYS_WAIT_H 1
| #define HAVE_GRP_H 1
| #define HAVE_SYSLOG_H 1
| #define HAVE_WCHAR_H 1
| #define HAVE_ISINF 1
| #define SIZEOF_VOID_P 4
| #define MONO_XEN_OPT 1
| #define DISABLED_FEATURES "none"
| #define HAVE_BOEHM_GC 1
| #define HAVE_GC_H 1
| #define USE_INCLUDED_LIBGC 1
| #define HAVE_GC_GCJ_MALLOC 1
| #define HAVE_GC_ENABLE 1
| #define USED_GC_NAME "Included Boehm (with typed GC)"
| #define HAVE_DL_LOADER 1
| /* end confdefs.h.  */
| #include <dlfcn.h>
| 			int mono_underscore_test (void) { return 42; }
| 			int main() {
| 			  void *f1 = (void*)0, *f2 = (void*)0, *handle;
| 			  handle = dlopen ((void*)0, 0);
| 			  if (handle) {
| 			    f1 = dlsym (handle, "mono_underscore_test");
| 			    f2 = dlsym (handle, "_mono_underscore_test");
| 			  } return (!f2 || f1);
| 			}
configure:26153: result: no
configure:26161: checking for dlerror
configure:26217: i686-pc-linux-gnu-gcc -o conftest -g -O2 -fno-strict-aliasing -Wdeclaration-after-statement -g -Wall -Wunused -Wmissing-prototypes -Wmissing-declarations -Wstrict-prototypes  -Wmissing-prototypes -Wnested-externs -Wpointer-arith -Wno-cast-qual -Wcast-align -Wwrite-strings -mno-tls-direct-seg-refs  -DGC_LINUX_THREADS -D_GNU_SOURCE -D_REENTRANT -DUSE_MMAP -DUSE_MUNMAP  conftest.c  -ldl >&5
conftest.c:68: warning: function declaration isn't a prototype
conftest.c:78: warning: function declaration isn't a prototype
configure:26223: $? = 0
configure:26230: test -z "$ac_c_werror_flag" || test ! -s conftest.err
configure:26233: $? = 0
configure:26240: test -s conftest
configure:26243: $? = 0
configure:26256: result: yes
configure:26293: checking execinfo.h usability
configure:26310: i686-pc-linux-gnu-gcc -c -g -O2 -fno-strict-aliasing -Wdeclaration-after-statement -g -Wall -Wunused -Wmissing-prototypes -Wmissing-declarations -Wstrict-prototypes  -Wmissing-prototypes -Wnested-externs -Wpointer-arith -Wno-cast-qual -Wcast-align -Wwrite-strings -mno-tls-direct-seg-refs  -DGC_LINUX_THREADS -D_GNU_SOURCE -D_REENTRANT -DUSE_MMAP -DUSE_MUNMAP conftest.c >&5
configure:26316: $? = 0
configure:26323: test -z "$ac_c_werror_flag" || test ! -s conftest.err
configure:26326: $? = 0
configure:26333: test -s conftest.o
configure:26336: $? = 0
configure:26347: result: yes
configure:26351: checking execinfo.h presence
configure:26366: i686-pc-linux-gnu-gcc -E  -DGC_LINUX_THREADS -D_GNU_SOURCE -D_REENTRANT -DUSE_MMAP -DUSE_MUNMAP conftest.c
configure:26372: $? = 0
configure:26393: result: yes
configure:26421: checking for execinfo.h
configure:26429: result: yes
configure:26447: checking for getgrgid_r
configure:26503: i686-pc-linux-gnu-gcc -o conftest -g -O2 -fno-strict-aliasing -Wdeclaration-after-statement -g -Wall -Wunused -Wmissing-prototypes -Wmissing-declarations -Wstrict-prototypes  -Wmissing-prototypes -Wnested-externs -Wpointer-arith -Wno-cast-qual -Wcast-align -Wwrite-strings -mno-tls-direct-seg-refs  -DGC_LINUX_THREADS -D_GNU_SOURCE -D_REENTRANT -DUSE_MMAP -DUSE_MUNMAP  conftest.c  -ldl >&5
conftest.c:69: warning: function declaration isn't a prototype
conftest.c:79: warning: function declaration isn't a prototype
configure:26509: $? = 0
configure:26516: test -z "$ac_c_werror_flag" || test ! -s conftest.err
configure:26519: $? = 0
configure:26526: test -s conftest
configure:26529: $? = 0
configure:26543: result: yes
configure:26557: checking for getgrnam_r
configure:26613: i686-pc-linux-gnu-gcc -o conftest -g -O2 -fno-strict-aliasing -Wdeclaration-after-statement -g -Wall -Wunused -Wmissing-prototypes -Wmissing-declarations -Wstrict-prototypes  -Wmissing-prototypes -Wnested-externs -Wpointer-arith -Wno-cast-qual -Wcast-align -Wwrite-strings -mno-tls-direct-seg-refs  -DGC_LINUX_THREADS -D_GNU_SOURCE -D_REENTRANT -DUSE_MMAP -DUSE_MUNMAP  conftest.c  -ldl >&5
conftest.c:70: warning: function declaration isn't a prototype
conftest.c:80: warning: function declaration isn't a prototype
configure:26619: $? = 0
configure:26626: test -z "$ac_c_werror_flag" || test ! -s conftest.err
configure:26629: $? = 0
configure:26636: test -s conftest
configure:26639: $? = 0
configure:26653: result: yes
configure:26667: checking for getpwnam_r
configure:26723: i686-pc-linux-gnu-gcc -o conftest -g -O2 -fno-strict-aliasing -Wdeclaration-after-statement -g -Wall -Wunused -Wmissing-prototypes -Wmissing-declarations -Wstrict-prototypes  -Wmissing-prototypes -Wnested-externs -Wpointer-arith -Wno-cast-qual -Wcast-align -Wwrite-strings -mno-tls-direct-seg-refs  -DGC_LINUX_THREADS -D_GNU_SOURCE -D_REENTRANT -DUSE_MMAP -DUSE_MUNMAP  conftest.c  -ldl >&5
conftest.c:71: warning: function declaration isn't a prototype
conftest.c:81: warning: function declaration isn't a prototype
configure:26729: $? = 0
configure:26736: test -z "$ac_c_werror_flag" || test ! -s conftest.err
configure:26739: $? = 0
configure:26746: test -s conftest
configure:26749: $? = 0
configure:26763: result: yes
configure:26777: checking for getpwuid_r
configure:26833: i686-pc-linux-gnu-gcc -o conftest -g -O2 -fno-strict-aliasing -Wdeclaration-after-statement -g -Wall -Wunused -Wmissing-prototypes -Wmissing-declarations -Wstrict-prototypes  -Wmissing-prototypes -Wnested-externs -Wpointer-arith -Wno-cast-qual -Wcast-align -Wwrite-strings -mno-tls-direct-seg-refs  -DGC_LINUX_THREADS -D_GNU_SOURCE -D_REENTRANT -DUSE_MMAP -DUSE_MUNMAP  conftest.c  -ldl >&5
conftest.c:72: warning: function declaration isn't a prototype
conftest.c:82: warning: function declaration isn't a prototype
configure:26839: $? = 0
configure:26846: test -z "$ac_c_werror_flag" || test ! -s conftest.err
configure:26849: $? = 0
configure:26856: test -s conftest
configure:26859: $? = 0
configure:26873: result: yes
configure:26887: checking for getresuid
configure:26943: i686-pc-linux-gnu-gcc -o conftest -g -O2 -fno-strict-aliasing -Wdeclaration-after-statement -g -Wall -Wunused -Wmissing-prototypes -Wmissing-declarations -Wstrict-prototypes  -Wmissing-prototypes -Wnested-externs -Wpointer-arith -Wno-cast-qual -Wcast-align -Wwrite-strings -mno-tls-direct-seg-refs  -DGC_LINUX_THREADS -D_GNU_SOURCE -D_REENTRANT -DUSE_MMAP -DUSE_MUNMAP  conftest.c  -ldl >&5
conftest.c:73: warning: function declaration isn't a prototype
conftest.c:83: warning: function declaration isn't a prototype
configure:26949: $? = 0
configure:26956: test -z "$ac_c_werror_flag" || test ! -s conftest.err
configure:26959: $? = 0
configure:26966: test -s conftest
configure:26969: $? = 0
configure:26983: result: yes
configure:26997: checking for setresuid
configure:27053: i686-pc-linux-gnu-gcc -o conftest -g -O2 -fno-strict-aliasing -Wdeclaration-after-statement -g -Wall -Wunused -Wmissing-prototypes -Wmissing-declarations -Wstrict-prototypes  -Wmissing-prototypes -Wnested-externs -Wpointer-arith -Wno-cast-qual -Wcast-align -Wwrite-strings -mno-tls-direct-seg-refs  -DGC_LINUX_THREADS -D_GNU_SOURCE -D_REENTRANT -DUSE_MMAP -DUSE_MUNMAP  conftest.c  -ldl >&5
conftest.c:74: warning: function declaration isn't a prototype
conftest.c:84: warning: function declaration isn't a prototype
configure:27059: $? = 0
configure:27066: test -z "$ac_c_werror_flag" || test ! -s conftest.err
configure:27069: $? = 0
configure:27076: test -s conftest
configure:27079: $? = 0
configure:27093: result: yes
configure:27107: checking for kqueue
configure:27163: i686-pc-linux-gnu-gcc -o conftest -g -O2 -fno-strict-aliasing -Wdeclaration-after-statement -g -Wall -Wunused -Wmissing-prototypes -Wmissing-declarations -Wstrict-prototypes  -Wmissing-prototypes -Wnested-externs -Wpointer-arith -Wno-cast-qual -Wcast-align -Wwrite-strings -mno-tls-direct-seg-refs  -DGC_LINUX_THREADS -D_GNU_SOURCE -D_REENTRANT -DUSE_MMAP -DUSE_MUNMAP  conftest.c  -ldl >&5
conftest.c:75: warning: function declaration isn't a prototype
conftest.c:85: warning: function declaration isn't a prototype
/tmp/cckRzN3r.o: In function `main':
/usr/local/src/mono/conftest.c:86: undefined reference to `kqueue'
collect2: ld returned 1 exit status
configure:27169: $? = 1
configure: failed program was:
| /* confdefs.h.  */
| #define PACKAGE_NAME ""
| #define PACKAGE_TARNAME ""
| #define PACKAGE_VERSION ""
| #define PACKAGE_STRING ""
| #define PACKAGE_BUGREPORT ""
| #define PACKAGE "mono"
| #define VERSION "1.2"
| #define STDC_HEADERS 1
| #define HAVE_SYS_TYPES_H 1
| #define HAVE_SYS_STAT_H 1
| #define HAVE_STDLIB_H 1
| #define HAVE_STRING_H 1
| #define HAVE_MEMORY_H 1
| #define HAVE_STRINGS_H 1
| #define HAVE_INTTYPES_H 1
| #define HAVE_STDINT_H 1
| #define HAVE_UNISTD_H 1
| #define HAVE_DLFCN_H 1
| #define HAVE_NETDB_H 1
| #define HAVE_UTIME_H 1
| #define HAVE_SEMAPHORE_H 1
| #define HAVE_SYS_UN_H 1
| #define HAVE_LINUX_RTC_H 1
| #define HAVE_SYS_SYSCALL_H 1
| #define HAVE_ELF_H 1
| #define HAVE_POLL_H 1
| #define HAVE_SYS_POLL_H 1
| #define HAVE_SYS_WAIT_H 1
| #define HAVE_GRP_H 1
| #define HAVE_SYSLOG_H 1
| #define HAVE_WCHAR_H 1
| #define HAVE_ISINF 1
| #define SIZEOF_VOID_P 4
| #define MONO_XEN_OPT 1
| #define DISABLED_FEATURES "none"
| #define HAVE_BOEHM_GC 1
| #define HAVE_GC_H 1
| #define USE_INCLUDED_LIBGC 1
| #define HAVE_GC_GCJ_MALLOC 1
| #define HAVE_GC_ENABLE 1
| #define USED_GC_NAME "Included Boehm (with typed GC)"
| #define HAVE_DL_LOADER 1
| #define HAVE_EXECINFO_H 1
| #define HAVE_GETGRGID_R 1
| #define HAVE_GETGRNAM_R 1
| #define HAVE_GETPWNAM_R 1
| #define HAVE_GETPWUID_R 1
| #define HAVE_GETRESUID 1
| #define HAVE_SETRESUID 1
| /* end confdefs.h.  */
| /* Define kqueue to an innocuous variant, in case <limits.h> declares kqueue.
|    For example, HP-UX 11i <limits.h> declares gettimeofday.  */
| #define kqueue innocuous_kqueue
| 
| /* System header to define __stub macros and hopefully few prototypes,
|     which can conflict with char kqueue (); below.
|     Prefer <limits.h> to <assert.h> if __STDC__ is defined, since
|     <limits.h> exists even on freestanding compilers.  */
| 
| #ifdef __STDC__
| # include <limits.h>
| #else
| # include <assert.h>
| #endif
| 
| #undef kqueue
| 
| /* Override any GCC internal prototype to avoid an error.
|    Use char because int might match the return type of a GCC
|    builtin and then its argument prototype would still apply.  */
| #ifdef __cplusplus
| extern "C"
| #endif
| char kqueue ();
| /* The GNU C library defines this for functions which it implements
|     to always fail with ENOSYS.  Some functions are actually named
|     something starting with __ and the normal name is an alias.  */
| #if defined __stub_kqueue || defined __stub___kqueue
| choke me
| #endif
| 
| int
| main ()
| {
| return kqueue ();
|   ;
|   return 0;
| }
configure:27203: result: no
configure:27217: checking for backtrace_symbols
configure:27273: i686-pc-linux-gnu-gcc -o conftest -g -O2 -fno-strict-aliasing -Wdeclaration-after-statement -g -Wall -Wunused -Wmissing-prototypes -Wmissing-declarations -Wstrict-prototypes  -Wmissing-prototypes -Wnested-externs -Wpointer-arith -Wno-cast-qual -Wcast-align -Wwrite-strings -mno-tls-direct-seg-refs  -DGC_LINUX_THREADS -D_GNU_SOURCE -D_REENTRANT -DUSE_MMAP -DUSE_MUNMAP  conftest.c  -ldl >&5
conftest.c:75: warning: function declaration isn't a prototype
conftest.c:85: warning: function declaration isn't a prototype
configure:27279: $? = 0
configure:27286: test -z "$ac_c_werror_flag" || test ! -s conftest.err
configure:27289: $? = 0
configure:27296: test -s conftest
configure:27299: $? = 0
configure:27313: result: yes
configure:27327: checking for mkstemp
configure:27383: i686-pc-linux-gnu-gcc -o conftest -g -O2 -fno-strict-aliasing -Wdeclaration-after-statement -g -Wall -Wunused -Wmissing-prototypes -Wmissing-declarations -Wstrict-prototypes  -Wmissing-prototypes -Wnested-externs -Wpointer-arith -Wno-cast-qual -Wcast-align -Wwrite-strings -mno-tls-direct-seg-refs  -DGC_LINUX_THREADS -D_GNU_SOURCE -D_REENTRANT -DUSE_MMAP -DUSE_MUNMAP  conftest.c  -ldl >&5
conftest.c:76: warning: function declaration isn't a prototype
conftest.c:86: warning: function declaration isn't a prototype
configure:27389: $? = 0
configure:27396: test -z "$ac_c_werror_flag" || test ! -s conftest.err
configure:27399: $? = 0
configure:27406: test -s conftest
configure:27409: $? = 0
configure:27423: result: yes
configure:27437: checking for mmap
configure:27493: i686-pc-linux-gnu-gcc -o conftest -g -O2 -fno-strict-aliasing -Wdeclaration-after-statement -g -Wall -Wunused -Wmissing-prototypes -Wmissing-declarations -Wstrict-prototypes  -Wmissing-prototypes -Wnested-externs -Wpointer-arith -Wno-cast-qual -Wcast-align -Wwrite-strings -mno-tls-direct-seg-refs  -DGC_LINUX_THREADS -D_GNU_SOURCE -D_REENTRANT -DUSE_MMAP -DUSE_MUNMAP  conftest.c  -ldl >&5
conftest.c:77: warning: function declaration isn't a prototype
conftest.c:87: warning: function declaration isn't a prototype
configure:27499: $? = 0
configure:27506: test -z "$ac_c_werror_flag" || test ! -s conftest.err
configure:27509: $? = 0
configure:27516: test -s conftest
configure:27519: $? = 0
configure:27533: result: yes
configure:27547: checking for madvise
configure:27603: i686-pc-linux-gnu-gcc -o conftest -g -O2 -fno-strict-aliasing -Wdeclaration-after-statement -g -Wall -Wunused -Wmissing-prototypes -Wmissing-declarations -Wstrict-prototypes  -Wmissing-prototypes -Wnested-externs -Wpointer-arith -Wno-cast-qual -Wcast-align -Wwrite-strings -mno-tls-direct-seg-refs  -DGC_LINUX_THREADS -D_GNU_SOURCE -D_REENTRANT -DUSE_MMAP -DUSE_MUNMAP  conftest.c  -ldl >&5
conftest.c:78: warning: function declaration isn't a prototype
conftest.c:88: warning: function declaration isn't a prototype
configure:27609: $? = 0
configure:27616: test -z "$ac_c_werror_flag" || test ! -s conftest.err
configure:27619: $? = 0
configure:27626: test -s conftest
configure:27629: $? = 0
configure:27643: result: yes
configure:27661: checking if off_t is 64 bits wide
configure:27697: i686-pc-linux-gnu-gcc -o conftest -g -O2 -fno-strict-aliasing -Wdeclaration-after-statement -g -Wall -Wunused -Wmissing-prototypes -Wmissing-declarations -Wstrict-prototypes  -Wmissing-prototypes -Wnested-externs -Wpointer-arith -Wno-cast-qual -Wcast-align -Wwrite-strings -mno-tls-direct-seg-refs  -DGC_LINUX_THREADS -D_GNU_SOURCE -D_REENTRANT -DUSE_MMAP -DUSE_MUNMAP   conftest.c  -ldl >&5
conftest.c: In function `main':
conftest.c:62: warning: left shift count >= width of type
conftest.c:62: warning: left shift count >= width of type
conftest.c:65: warning: implicit declaration of function `exit'
conftest.c:65: warning: nested extern declaration of `exit'
conftest.c:67: warning: nested extern declaration of `exit'
configure:27700: $? = 0
configure:27706: ./conftest
configure:27709: $? = 1
configure: program exited with status 1
configure: failed program was:
| /* confdefs.h.  */
| #define PACKAGE_NAME ""
| #define PACKAGE_TARNAME ""
| #define PACKAGE_VERSION ""
| #define PACKAGE_STRING ""
| #define PACKAGE_BUGREPORT ""
| #define PACKAGE "mono"
| #define VERSION "1.2"
| #define STDC_HEADERS 1
| #define HAVE_SYS_TYPES_H 1
| #define HAVE_SYS_STAT_H 1
| #define HAVE_STDLIB_H 1
| #define HAVE_STRING_H 1
| #define HAVE_MEMORY_H 1
| #define HAVE_STRINGS_H 1
| #define HAVE_INTTYPES_H 1
| #define HAVE_STDINT_H 1
| #define HAVE_UNISTD_H 1
| #define HAVE_DLFCN_H 1
| #define HAVE_NETDB_H 1
| #define HAVE_UTIME_H 1
| #define HAVE_SEMAPHORE_H 1
| #define HAVE_SYS_UN_H 1
| #define HAVE_LINUX_RTC_H 1
| #define HAVE_SYS_SYSCALL_H 1
| #define HAVE_ELF_H 1
| #define HAVE_POLL_H 1
| #define HAVE_SYS_POLL_H 1
| #define HAVE_SYS_WAIT_H 1
| #define HAVE_GRP_H 1
| #define HAVE_SYSLOG_H 1
| #define HAVE_WCHAR_H 1
| #define HAVE_ISINF 1
| #define SIZEOF_VOID_P 4
| #define MONO_XEN_OPT 1
| #define DISABLED_FEATURES "none"
| #define HAVE_BOEHM_GC 1
| #define HAVE_GC_H 1
| #define USE_INCLUDED_LIBGC 1
| #define HAVE_GC_GCJ_MALLOC 1
| #define HAVE_GC_ENABLE 1
| #define USED_GC_NAME "Included Boehm (with typed GC)"
| #define HAVE_DL_LOADER 1
| #define HAVE_EXECINFO_H 1
| #define HAVE_GETGRGID_R 1
| #define HAVE_GETGRNAM_R 1
| #define HAVE_GETPWNAM_R 1
| #define HAVE_GETPWUID_R 1
| #define HAVE_GETRESUID 1
| #define HAVE_SETRESUID 1
| #define HAVE_BACKTRACE_SYMBOLS 1
| #define HAVE_MKSTEMP 1
| #define HAVE_MMAP 1
| #define HAVE_MADVISE 1
| /* end confdefs.h.  */
| 
| 			#include <sys/types.h>
| 
| 			#define BIG_OFF_T (((off_t)1<<62)-1+((off_t)1<<62))
| 
| 			int main(void) {
| 				int big_off_t=((BIG_OFF_T%2147483629==721) &&
| 					       (BIG_OFF_T%2147483647==1));
| 				if(big_off_t) {
| 					exit(0);
| 				} else {
| 					exit(1);
| 				}
| 			}
| 
configure:27728: result: no
configure:27739: checking if _FILE_OFFSET_BITS=64 gives 64 bit off_t
configure:27775: i686-pc-linux-gnu-gcc -o conftest -g -O2 -fno-strict-aliasing -Wdeclaration-after-statement -g -Wall -Wunused -Wmissing-prototypes -Wmissing-declarations -Wstrict-prototypes  -Wmissing-prototypes -Wnested-externs -Wpointer-arith -Wno-cast-qual -Wcast-align -Wwrite-strings -mno-tls-direct-seg-refs  -DGC_LINUX_THREADS -D_GNU_SOURCE -D_REENTRANT -DUSE_MMAP -DUSE_MUNMAP -D_FILE_OFFSET_BITS=64  conftest.c  -ldl >&5
conftest.c: In function `main':
conftest.c:65: warning: implicit declaration of function `exit'
conftest.c:65: warning: nested extern declaration of `exit'
conftest.c:67: warning: nested extern declaration of `exit'
configure:27778: $? = 0
configure:27784: ./conftest
configure:27787: $? = 0
configure:27790: result: ok
configure:27822: checking for socket in -lsocket
configure:27857: i686-pc-linux-gnu-gcc -o conftest -g -O2 -fno-strict-aliasing -Wdeclaration-after-statement -g -Wall -Wunused -Wmissing-prototypes -Wmissing-declarations -Wstrict-prototypes  -Wmissing-prototypes -Wnested-externs -Wpointer-arith -Wno-cast-qual -Wcast-align -Wwrite-strings -mno-tls-direct-seg-refs  -DGC_LINUX_THREADS -D_GNU_SOURCE -D_REENTRANT -DUSE_MMAP -DUSE_MUNMAP -D_FILE_OFFSET_BITS=64  conftest.c -lsocket   -ldl >&5
conftest.c:64: warning: function declaration isn't a prototype
conftest.c:67: warning: function declaration isn't a prototype
/usr/lib/gcc/i686-pc-linux-gnu/3.4.6/../../../../i686-pc-linux-gnu/bin/ld: cannot find -lsocket
collect2: ld returned 1 exit status
configure:27863: $? = 1
configure: failed program was:
| /* confdefs.h.  */
| #define PACKAGE_NAME ""
| #define PACKAGE_TARNAME ""
| #define PACKAGE_VERSION ""
| #define PACKAGE_STRING ""
| #define PACKAGE_BUGREPORT ""
| #define PACKAGE "mono"
| #define VERSION "1.2"
| #define STDC_HEADERS 1
| #define HAVE_SYS_TYPES_H 1
| #define HAVE_SYS_STAT_H 1
| #define HAVE_STDLIB_H 1
| #define HAVE_STRING_H 1
| #define HAVE_MEMORY_H 1
| #define HAVE_STRINGS_H 1
| #define HAVE_INTTYPES_H 1
| #define HAVE_STDINT_H 1
| #define HAVE_UNISTD_H 1
| #define HAVE_DLFCN_H 1
| #define HAVE_NETDB_H 1
| #define HAVE_UTIME_H 1
| #define HAVE_SEMAPHORE_H 1
| #define HAVE_SYS_UN_H 1
| #define HAVE_LINUX_RTC_H 1
| #define HAVE_SYS_SYSCALL_H 1
| #define HAVE_ELF_H 1
| #define HAVE_POLL_H 1
| #define HAVE_SYS_POLL_H 1
| #define HAVE_SYS_WAIT_H 1
| #define HAVE_GRP_H 1
| #define HAVE_SYSLOG_H 1
| #define HAVE_WCHAR_H 1
| #define HAVE_ISINF 1
| #define SIZEOF_VOID_P 4
| #define MONO_XEN_OPT 1
| #define DISABLED_FEATURES "none"
| #define HAVE_BOEHM_GC 1
| #define HAVE_GC_H 1
| #define USE_INCLUDED_LIBGC 1
| #define HAVE_GC_GCJ_MALLOC 1
| #define HAVE_GC_ENABLE 1
| #define USED_GC_NAME "Included Boehm (with typed GC)"
| #define HAVE_DL_LOADER 1
| #define HAVE_EXECINFO_H 1
| #define HAVE_GETGRGID_R 1
| #define HAVE_GETGRNAM_R 1
| #define HAVE_GETPWNAM_R 1
| #define HAVE_GETPWUID_R 1
| #define HAVE_GETRESUID 1
| #define HAVE_SETRESUID 1
| #define HAVE_BACKTRACE_SYMBOLS 1
| #define HAVE_MKSTEMP 1
| #define HAVE_MMAP 1
| #define HAVE_MADVISE 1
| #define HAVE_LARGE_FILE_SUPPORT 1
| /* end confdefs.h.  */
| 
| /* Override any GCC internal prototype to avoid an error.
|    Use char because int might match the return type of a GCC
|    builtin and then its argument prototype would still apply.  */
| #ifdef __cplusplus
| extern "C"
| #endif
| char socket ();
| int
| main ()
| {
| return socket ();
|   ;
|   return 0;
| }
configure:27897: result: no
configure:27904: checking for MSG_NOSIGNAL
configure:27929: i686-pc-linux-gnu-gcc -c -g -O2 -fno-strict-aliasing -Wdeclaration-after-statement -g -Wall -Wunused -Wmissing-prototypes -Wmissing-declarations -Wstrict-prototypes  -Wmissing-prototypes -Wnested-externs -Wpointer-arith -Wno-cast-qual -Wcast-align -Wwrite-strings -mno-tls-direct-seg-refs  -DGC_LINUX_THREADS -D_GNU_SOURCE -D_REENTRANT -DUSE_MMAP -DUSE_MUNMAP -D_FILE_OFFSET_BITS=64 conftest.c >&5
conftest.c:60: warning: function declaration isn't a prototype
conftest.c: In function `main':
conftest.c:62: warning: unused variable `f'
configure:27935: $? = 0
configure:27942: test -z "$ac_c_werror_flag" || test ! -s conftest.err
configure:27945: $? = 0
configure:27952: test -s conftest.o
configure:27955: $? = 0
configure:27959: result: yes
configure:27979: checking for SOL_IP
configure:28004: i686-pc-linux-gnu-gcc -c -g -O2 -fno-strict-aliasing -Wdeclaration-after-statement -g -Wall -Wunused -Wmissing-prototypes -Wmissing-declarations -Wstrict-prototypes  -Wmissing-prototypes -Wnested-externs -Wpointer-arith -Wno-cast-qual -Wcast-align -Wwrite-strings -mno-tls-direct-seg-refs  -DGC_LINUX_THREADS -D_GNU_SOURCE -D_REENTRANT -DUSE_MMAP -DUSE_MUNMAP -D_FILE_OFFSET_BITS=64 conftest.c >&5
conftest.c:61: warning: function declaration isn't a prototype
conftest.c: In function `main':
conftest.c:63: warning: unused variable `level'
configure:28010: $? = 0
configure:28017: test -z "$ac_c_werror_flag" || test ! -s conftest.err
configure:28020: $? = 0
configure:28027: test -s conftest.o
configure:28030: $? = 0
configure:28034: result: yes
configure:28054: checking for SOL_IPV6
configure:28079: i686-pc-linux-gnu-gcc -c -g -O2 -fno-strict-aliasing -Wdeclaration-after-statement -g -Wall -Wunused -Wmissing-prototypes -Wmissing-declarations -Wstrict-prototypes  -Wmissing-prototypes -Wnested-externs -Wpointer-arith -Wno-cast-qual -Wcast-align -Wwrite-strings -mno-tls-direct-seg-refs  -DGC_LINUX_THREADS -D_GNU_SOURCE -D_REENTRANT -DUSE_MMAP -DUSE_MUNMAP -D_FILE_OFFSET_BITS=64 conftest.c >&5
conftest.c:62: warning: function declaration isn't a prototype
conftest.c: In function `main':
conftest.c:64: warning: unused variable `level'
configure:28085: $? = 0
configure:28092: test -z "$ac_c_werror_flag" || test ! -s conftest.err
configure:28095: $? = 0
configure:28102: test -s conftest.o
configure:28105: $? = 0
configure:28109: result: yes
configure:28129: checking for SOL_TCP
configure:28154: i686-pc-linux-gnu-gcc -c -g -O2 -fno-strict-aliasing -Wdeclaration-after-statement -g -Wall -Wunused -Wmissing-prototypes -Wmissing-declarations -Wstrict-prototypes  -Wmissing-prototypes -Wnested-externs -Wpointer-arith -Wno-cast-qual -Wcast-align -Wwrite-strings -mno-tls-direct-seg-refs  -DGC_LINUX_THREADS -D_GNU_SOURCE -D_REENTRANT -DUSE_MMAP -DUSE_MUNMAP -D_FILE_OFFSET_BITS=64 conftest.c >&5
conftest.c:63: warning: function declaration isn't a prototype
conftest.c: In function `main':
conftest.c:65: error: `SOL_TCP' undeclared (first use in this function)
conftest.c:65: error: (Each undeclared identifier is reported only once
conftest.c:65: error: for each function it appears in.)
conftest.c:65: warning: unused variable `level'
configure:28160: $? = 1
configure: failed program was:
| /* confdefs.h.  */
| #define PACKAGE_NAME ""
| #define PACKAGE_TARNAME ""
| #define PACKAGE_VERSION ""
| #define PACKAGE_STRING ""
| #define PACKAGE_BUGREPORT ""
| #define PACKAGE "mono"
| #define VERSION "1.2"
| #define STDC_HEADERS 1
| #define HAVE_SYS_TYPES_H 1
| #define HAVE_SYS_STAT_H 1
| #define HAVE_STDLIB_H 1
| #define HAVE_STRING_H 1
| #define HAVE_MEMORY_H 1
| #define HAVE_STRINGS_H 1
| #define HAVE_INTTYPES_H 1
| #define HAVE_STDINT_H 1
| #define HAVE_UNISTD_H 1
| #define HAVE_DLFCN_H 1
| #define HAVE_NETDB_H 1
| #define HAVE_UTIME_H 1
| #define HAVE_SEMAPHORE_H 1
| #define HAVE_SYS_UN_H 1
| #define HAVE_LINUX_RTC_H 1
| #define HAVE_SYS_SYSCALL_H 1
| #define HAVE_ELF_H 1
| #define HAVE_POLL_H 1
| #define HAVE_SYS_POLL_H 1
| #define HAVE_SYS_WAIT_H 1
| #define HAVE_GRP_H 1
| #define HAVE_SYSLOG_H 1
| #define HAVE_WCHAR_H 1
| #define HAVE_ISINF 1
| #define SIZEOF_VOID_P 4
| #define MONO_XEN_OPT 1
| #define DISABLED_FEATURES "none"
| #define HAVE_BOEHM_GC 1
| #define HAVE_GC_H 1
| #define USE_INCLUDED_LIBGC 1
| #define HAVE_GC_GCJ_MALLOC 1
| #define HAVE_GC_ENABLE 1
| #define USED_GC_NAME "Included Boehm (with typed GC)"
| #define HAVE_DL_LOADER 1
| #define HAVE_EXECINFO_H 1
| #define HAVE_GETGRGID_R 1
| #define HAVE_GETGRNAM_R 1
| #define HAVE_GETPWNAM_R 1
| #define HAVE_GETPWUID_R 1
| #define HAVE_GETRESUID 1
| #define HAVE_SETRESUID 1
| #define HAVE_BACKTRACE_SYMBOLS 1
| #define HAVE_MKSTEMP 1
| #define HAVE_MMAP 1
| #define HAVE_MADVISE 1
| #define HAVE_LARGE_FILE_SUPPORT 1
| #define HAVE_MSG_NOSIGNAL 1
| #define HAVE_SOL_IP 1
| #define HAVE_SOL_IPV6 1
| /* end confdefs.h.  */
| #include <netdb.h>
| int
| main ()
| {
| 
| 		int level = SOL_TCP;
| 
|   ;
|   return 0;
| }
configure:28197: result: no
configure:28204: checking for IP_PKTINFO
configure:28229: i686-pc-linux-gnu-gcc -c -g -O2 -fno-strict-aliasing -Wdeclaration-after-statement -g -Wall -Wunused -Wmissing-prototypes -Wmissing-declarations -Wstrict-prototypes  -Wmissing-prototypes -Wnested-externs -Wpointer-arith -Wno-cast-qual -Wcast-align -Wwrite-strings -mno-tls-direct-seg-refs  -DGC_LINUX_THREADS -D_GNU_SOURCE -D_REENTRANT -DUSE_MMAP -DUSE_MUNMAP -D_FILE_OFFSET_BITS=64 conftest.c >&5
conftest.c:63: warning: function declaration isn't a prototype
conftest.c: In function `main':
conftest.c:65: warning: unused variable `level'
configure:28235: $? = 0
configure:28242: test -z "$ac_c_werror_flag" || test ! -s conftest.err
configure:28245: $? = 0
configure:28252: test -s conftest.o
configure:28255: $? = 0
configure:28259: result: yes
configure:28278: checking for IPV6_PKTINFO
configure:28303: i686-pc-linux-gnu-gcc -c -g -O2 -fno-strict-aliasing -Wdeclaration-after-statement -g -Wall -Wunused -Wmissing-prototypes -Wmissing-declarations -Wstrict-prototypes  -Wmissing-prototypes -Wnested-externs -Wpointer-arith -Wno-cast-qual -Wcast-align -Wwrite-strings -mno-tls-direct-seg-refs  -DGC_LINUX_THREADS -D_GNU_SOURCE -D_REENTRANT -DUSE_MMAP -DUSE_MUNMAP -D_FILE_OFFSET_BITS=64 conftest.c >&5
conftest.c:64: warning: function declaration isn't a prototype
conftest.c: In function `main':
conftest.c:66: warning: unused variable `level'
configure:28309: $? = 0
configure:28316: test -z "$ac_c_werror_flag" || test ! -s conftest.err
configure:28319: $? = 0
configure:28326: test -s conftest.o
configure:28329: $? = 0
configure:28333: result: yes
configure:28352: checking for struct ip_mreqn
configure:28378: i686-pc-linux-gnu-gcc -c -g -O2 -fno-strict-aliasing -Wdeclaration-after-statement -g -Wall -Wunused -Wmissing-prototypes -Wmissing-declarations -Wstrict-prototypes  -Wmissing-prototypes -Wnested-externs -Wpointer-arith -Wno-cast-qual -Wcast-align -Wwrite-strings -mno-tls-direct-seg-refs  -DGC_LINUX_THREADS -D_GNU_SOURCE -D_REENTRANT -DUSE_MMAP -DUSE_MUNMAP -D_FILE_OFFSET_BITS=64 conftest.c >&5
conftest.c:65: warning: function declaration isn't a prototype
configure:28384: $? = 0
configure:28391: test -z "$ac_c_werror_flag" || test ! -s conftest.err
configure:28394: $? = 0
configure:28401: test -s conftest.o
configure:28404: $? = 0
configure:28408: result: yes
configure:28503: checking for gethostbyname2_r
configure:28528: i686-pc-linux-gnu-gcc -o conftest -g -O2 -fno-strict-aliasing -Wdeclaration-after-statement -g -Wall -Wunused -Wmissing-prototypes -Wmissing-declarations -Wstrict-prototypes  -Wmissing-prototypes -Wnested-externs -Wpointer-arith -Wno-cast-qual -Wcast-align -Wwrite-strings -mno-tls-direct-seg-refs  -DGC_LINUX_THREADS -D_GNU_SOURCE -D_REENTRANT -DUSE_MMAP -DUSE_MUNMAP -D_FILE_OFFSET_BITS=64  conftest.c  -ldl >&5
conftest.c:66: warning: function declaration isn't a prototype
configure:28534: $? = 0
configure:28541: test -z "$ac_c_werror_flag" || test ! -s conftest.err
configure:28544: $? = 0
configure:28551: test -s conftest
configure:28554: $? = 0
configure:28558: result: yes
configure:28578: checking for gethostbyaddr
configure:28634: i686-pc-linux-gnu-gcc -o conftest -g -O2 -fno-strict-aliasing -Wdeclaration-after-statement -g -Wall -Wunused -Wmissing-prototypes -Wmissing-declarations -Wstrict-prototypes  -Wmissing-prototypes -Wnested-externs -Wpointer-arith -Wno-cast-qual -Wcast-align -Wwrite-strings -mno-tls-direct-seg-refs  -DGC_LINUX_THREADS -D_GNU_SOURCE -D_REENTRANT -DUSE_MMAP -DUSE_MUNMAP -D_FILE_OFFSET_BITS=64  conftest.c  -ldl >&5
conftest.c:87: warning: function declaration isn't a prototype
conftest.c:97: warning: function declaration isn't a prototype
configure:28640: $? = 0
configure:28647: test -z "$ac_c_werror_flag" || test ! -s conftest.err
configure:28650: $? = 0
configure:28657: test -s conftest
configure:28660: $? = 0
configure:28673: result: yes
configure:28767: checking for inet_pton
configure:28823: i686-pc-linux-gnu-gcc -o conftest -g -O2 -fno-strict-aliasing -Wdeclaration-after-statement -g -Wall -Wunused -Wmissing-prototypes -Wmissing-declarations -Wstrict-prototypes  -Wmissing-prototypes -Wnested-externs -Wpointer-arith -Wno-cast-qual -Wcast-align -Wwrite-strings -mno-tls-direct-seg-refs  -DGC_LINUX_THREADS -D_GNU_SOURCE -D_REENTRANT -DUSE_MMAP -DUSE_MUNMAP -D_FILE_OFFSET_BITS=64  conftest.c  -ldl >&5
conftest.c:87: warning: function declaration isn't a prototype
conftest.c:97: warning: function declaration isn't a prototype
configure:28829: $? = 0
configure:28836: test -z "$ac_c_werror_flag" || test ! -s conftest.err
configure:28839: $? = 0
configure:28846: test -s conftest
configure:28849: $? = 0
configure:28863: result: yes
configure:28767: checking for inet_aton
configure:28823: i686-pc-linux-gnu-gcc -o conftest -g -O2 -fno-strict-aliasing -Wdeclaration-after-statement -g -Wall -Wunused -Wmissing-prototypes -Wmissing-declarations -Wstrict-prototypes  -Wmissing-prototypes -Wnested-externs -Wpointer-arith -Wno-cast-qual -Wcast-align -Wwrite-strings -mno-tls-direct-seg-refs  -DGC_LINUX_THREADS -D_GNU_SOURCE -D_REENTRANT -DUSE_MMAP -DUSE_MUNMAP -D_FILE_OFFSET_BITS=64  conftest.c  -ldl >&5
conftest.c:88: warning: function declaration isn't a prototype
conftest.c:98: warning: function declaration isn't a prototype
configure:28829: $? = 0
configure:28836: test -z "$ac_c_werror_flag" || test ! -s conftest.err
configure:28839: $? = 0
configure:28846: test -s conftest
configure:28849: $? = 0
configure:28863: result: yes
configure:28875: checking size of sockaddr_un.sun_path
configure:28909: i686-pc-linux-gnu-gcc -o conftest -g -O2 -fno-strict-aliasing -Wdeclaration-after-statement -g -Wall -Wunused -Wmissing-prototypes -Wmissing-declarations -Wstrict-prototypes  -Wmissing-prototypes -Wnested-externs -Wpointer-arith -Wno-cast-qual -Wcast-align -Wwrite-strings -mno-tls-direct-seg-refs  -DGC_LINUX_THREADS -D_GNU_SOURCE -D_REENTRANT -DUSE_MMAP -DUSE_MUNMAP -D_FILE_OFFSET_BITS=64  conftest.c  -ldl >&5
conftest.c: In function `main':
conftest.c:74: warning: implicit declaration of function `exit'
conftest.c:74: warning: nested extern declaration of `exit'
configure:28912: $? = 0
configure:28918: ./conftest
configure:28921: $? = 0
configure:28937: result: 108
configure:28944: checking whether i686-pc-linux-gnu-gcc supports zero length arrays
configure:28972: i686-pc-linux-gnu-gcc -c -g -O2 -fno-strict-aliasing -Wdeclaration-after-statement -g -Wall -Wunused -Wmissing-prototypes -Wmissing-declarations -Wstrict-prototypes  -Wmissing-prototypes -Wnested-externs -Wpointer-arith -Wno-cast-qual -Wcast-align -Wwrite-strings -mno-tls-direct-seg-refs  -DGC_LINUX_THREADS -D_GNU_SOURCE -D_REENTRANT -DUSE_MMAP -DUSE_MUNMAP -D_FILE_OFFSET_BITS=64 conftest.c >&5
conftest.c:75: warning: function declaration isn't a prototype
configure:28978: $? = 0
configure:28985: test -z "$ac_c_werror_flag" || test ! -s conftest.err
configure:28988: $? = 0
configure:28995: test -s conftest.o
configure:28998: $? = 0
configure:29001: result: yes
configure:29282: checking for main in -lpthread
configure:29311: i686-pc-linux-gnu-gcc -o conftest -g -O2 -fno-strict-aliasing -Wdeclaration-after-statement -g -Wall -Wunused -Wmissing-prototypes -Wmissing-declarations -Wstrict-prototypes  -Wmissing-prototypes -Wnested-externs -Wpointer-arith -Wno-cast-qual -Wcast-align -Wwrite-strings -mno-tls-direct-seg-refs  -DGC_LINUX_THREADS -D_GNU_SOURCE -D_REENTRANT -DUSE_MMAP -DUSE_MUNMAP -D_FILE_OFFSET_BITS=64  conftest.c -lpthread   -ldl >&5
conftest.c:72: warning: function declaration isn't a prototype
configure:29317: $? = 0
configure:29324: test -z "$ac_c_werror_flag" || test ! -s conftest.err
configure:29327: $? = 0
configure:29334: test -s conftest
configure:29337: $? = 0
configure:29351: result: yes
configure:29374: checking pthread.h usability
configure:29391: i686-pc-linux-gnu-gcc -c -g -O2 -fno-strict-aliasing -Wdeclaration-after-statement -g -Wall -Wunused -Wmissing-prototypes -Wmissing-declarations -Wstrict-prototypes  -Wmissing-prototypes -Wnested-externs -Wpointer-arith -Wno-cast-qual -Wcast-align -Wwrite-strings -mno-tls-direct-seg-refs  -DGC_LINUX_THREADS -D_GNU_SOURCE -D_REENTRANT -DUSE_MMAP -DUSE_MUNMAP -D_FILE_OFFSET_BITS=64 conftest.c >&5
configure:29397: $? = 0
configure:29404: test -z "$ac_c_werror_flag" || test ! -s conftest.err
configure:29407: $? = 0
configure:29414: test -s conftest.o
configure:29417: $? = 0
configure:29428: result: yes
configure:29432: checking pthread.h presence
configure:29447: i686-pc-linux-gnu-gcc -E  -DGC_LINUX_THREADS -D_GNU_SOURCE -D_REENTRANT -DUSE_MMAP -DUSE_MUNMAP -D_FILE_OFFSET_BITS=64 conftest.c
configure:29453: $? = 0
configure:29474: result: yes
configure:29502: checking for pthread.h
configure:29510: result: yes
configure:29527: checking for pthread_mutex_timedlock
configure:29583: i686-pc-linux-gnu-gcc -o conftest -g -O2 -fno-strict-aliasing -Wdeclaration-after-statement -g -Wall -Wunused -Wmissing-prototypes -Wmissing-declarations -Wstrict-prototypes  -Wmissing-prototypes -Wnested-externs -Wpointer-arith -Wno-cast-qual -Wcast-align -Wwrite-strings -mno-tls-direct-seg-refs  -DGC_LINUX_THREADS -D_GNU_SOURCE -D_REENTRANT -DUSE_MMAP -DUSE_MUNMAP -D_FILE_OFFSET_BITS=64  conftest.c  -ldl -lpthread >&5
conftest.c:92: warning: function declaration isn't a prototype
conftest.c:102: warning: function declaration isn't a prototype
configure:29589: $? = 0
configure:29596: test -z "$ac_c_werror_flag" || test ! -s conftest.err
configure:29599: $? = 0
configure:29606: test -s conftest
configure:29609: $? = 0
configure:29623: result: yes
configure:29638: checking for pthread_getattr_np
configure:29694: i686-pc-linux-gnu-gcc -o conftest -g -O2 -fno-strict-aliasing -Wdeclaration-after-statement -g -Wall -Wunused -Wmissing-prototypes -Wmissing-declarations -Wstrict-prototypes  -Wmissing-prototypes -Wnested-externs -Wpointer-arith -Wno-cast-qual -Wcast-align -Wwrite-strings -mno-tls-direct-seg-refs  -DGC_LINUX_THREADS -D_GNU_SOURCE -D_REENTRANT -DUSE_MMAP -DUSE_MUNMAP -D_FILE_OFFSET_BITS=64  conftest.c  -ldl -lpthread >&5
conftest.c:93: warning: function declaration isn't a prototype
conftest.c:103: warning: function declaration isn't a prototype
configure:29700: $? = 0
configure:29707: test -z "$ac_c_werror_flag" || test ! -s conftest.err
configure:29710: $? = 0
configure:29717: test -s conftest
configure:29720: $? = 0
configure:29734: result: yes
configure:29638: checking for pthread_attr_get_np
configure:29694: i686-pc-linux-gnu-gcc -o conftest -g -O2 -fno-strict-aliasing -Wdeclaration-after-statement -g -Wall -Wunused -Wmissing-prototypes -Wmissing-declarations -Wstrict-prototypes  -Wmissing-prototypes -Wnested-externs -Wpointer-arith -Wno-cast-qual -Wcast-align -Wwrite-strings -mno-tls-direct-seg-refs  -DGC_LINUX_THREADS -D_GNU_SOURCE -D_REENTRANT -DUSE_MMAP -DUSE_MUNMAP -D_FILE_OFFSET_BITS=64  conftest.c  -ldl -lpthread >&5
conftest.c:94: warning: function declaration isn't a prototype
conftest.c:104: warning: function declaration isn't a prototype
/tmp/ccKzQukf.o: In function `main':
/usr/local/src/mono/conftest.c:105: undefined reference to `pthread_attr_get_np'
collect2: ld returned 1 exit status
configure:29700: $? = 1
configure: failed program was:
| /* confdefs.h.  */
| #define PACKAGE_NAME ""
| #define PACKAGE_TARNAME ""
| #define PACKAGE_VERSION ""
| #define PACKAGE_STRING ""
| #define PACKAGE_BUGREPORT ""
| #define PACKAGE "mono"
| #define VERSION "1.2"
| #define STDC_HEADERS 1
| #define HAVE_SYS_TYPES_H 1
| #define HAVE_SYS_STAT_H 1
| #define HAVE_STDLIB_H 1
| #define HAVE_STRING_H 1
| #define HAVE_MEMORY_H 1
| #define HAVE_STRINGS_H 1
| #define HAVE_INTTYPES_H 1
| #define HAVE_STDINT_H 1
| #define HAVE_UNISTD_H 1
| #define HAVE_DLFCN_H 1
| #define HAVE_NETDB_H 1
| #define HAVE_UTIME_H 1
| #define HAVE_SEMAPHORE_H 1
| #define HAVE_SYS_UN_H 1
| #define HAVE_LINUX_RTC_H 1
| #define HAVE_SYS_SYSCALL_H 1
| #define HAVE_ELF_H 1
| #define HAVE_POLL_H 1
| #define HAVE_SYS_POLL_H 1
| #define HAVE_SYS_WAIT_H 1
| #define HAVE_GRP_H 1
| #define HAVE_SYSLOG_H 1
| #define HAVE_WCHAR_H 1
| #define HAVE_ISINF 1
| #define SIZEOF_VOID_P 4
| #define MONO_XEN_OPT 1
| #define DISABLED_FEATURES "none"
| #define HAVE_BOEHM_GC 1
| #define HAVE_GC_H 1
| #define USE_INCLUDED_LIBGC 1
| #define HAVE_GC_GCJ_MALLOC 1
| #define HAVE_GC_ENABLE 1
| #define USED_GC_NAME "Included Boehm (with typed GC)"
| #define HAVE_DL_LOADER 1
| #define HAVE_EXECINFO_H 1
| #define HAVE_GETGRGID_R 1
| #define HAVE_GETGRNAM_R 1
| #define HAVE_GETPWNAM_R 1
| #define HAVE_GETPWUID_R 1
| #define HAVE_GETRESUID 1
| #define HAVE_SETRESUID 1
| #define HAVE_BACKTRACE_SYMBOLS 1
| #define HAVE_MKSTEMP 1
| #define HAVE_MMAP 1
| #define HAVE_MADVISE 1
| #define HAVE_LARGE_FILE_SUPPORT 1
| #define HAVE_MSG_NOSIGNAL 1
| #define HAVE_SOL_IP 1
| #define HAVE_SOL_IPV6 1
| #define HAVE_IP_PKTINFO 1
| #define HAVE_IPV6_PKTINFO 1
| #define HAVE_STRUCT_IP_MREQN 1
| #define HAVE_GETHOSTBYNAME2_R 1
| #define HAVE_INET_PTON 1
| #define HAVE_INET_ATON 1
| #define MONO_SIZEOF_SUNPATH 108
| #define MONO_ZERO_ARRAY_LENGTH 0
| #define HAVE_PTHREAD_H 1
| #define HAVE_PTHREAD_MUTEX_TIMEDLOCK 1
| #define HAVE_PTHREAD_GETATTR_NP 1
| /* end confdefs.h.  */
| /* Define pthread_attr_get_np to an innocuous variant, in case <limits.h> declares pthread_attr_get_np.
|    For example, HP-UX 11i <limits.h> declares gettimeofday.  */
| #define pthread_attr_get_np innocuous_pthread_attr_get_np
| 
| /* System header to define __stub macros and hopefully few prototypes,
|     which can conflict with char pthread_attr_get_np (); below.
|     Prefer <limits.h> to <assert.h> if __STDC__ is defined, since
|     <limits.h> exists even on freestanding compilers.  */
| 
| #ifdef __STDC__
| # include <limits.h>
| #else
| # include <assert.h>
| #endif
| 
| #undef pthread_attr_get_np
| 
| /* Override any GCC internal prototype to avoid an error.
|    Use char because int might match the return type of a GCC
|    builtin and then its argument prototype would still apply.  */
| #ifdef __cplusplus
| extern "C"
| #endif
| char pthread_attr_get_np ();
| /* The GNU C library defines this for functions which it implements
|     to always fail with ENOSYS.  Some functions are actually named
|     something starting with __ and the normal name is an alias.  */
| #if defined __stub_pthread_attr_get_np || defined __stub___pthread_attr_get_np
| choke me
| #endif
| 
| int
| main ()
| {
| return pthread_attr_get_np ();
|   ;
|   return 0;
| }
configure:29734: result: no
configure:29744: checking for PTHREAD_MUTEX_RECURSIVE
configure:29770: i686-pc-linux-gnu-gcc -c -g -O2 -fno-strict-aliasing -Wdeclaration-after-statement -g -Wall -Wunused -Wmissing-prototypes -Wmissing-declarations -Wstrict-prototypes  -Wmissing-prototypes -Wnested-externs -Wpointer-arith -Wno-cast-qual -Wcast-align -Wwrite-strings -mno-tls-direct-seg-refs  -DGC_LINUX_THREADS -D_GNU_SOURCE -D_REENTRANT -DUSE_MMAP -DUSE_MUNMAP -D_FILE_OFFSET_BITS=64 conftest.c >&5
conftest.c:74: warning: function declaration isn't a prototype
configure:29776: $? = 0
configure:29783: test -z "$ac_c_werror_flag" || test ! -s conftest.err
configure:29786: $? = 0
configure:29793: test -s conftest.o
configure:29796: $? = 0
configure:29799: result: ok
configure:29823: checking for pthread_attr_setstacksize
configure:29879: i686-pc-linux-gnu-gcc -o conftest -g -O2 -fno-strict-aliasing -Wdeclaration-after-statement -g -Wall -Wunused -Wmissing-prototypes -Wmissing-declarations -Wstrict-prototypes  -Wmissing-prototypes -Wnested-externs -Wpointer-arith -Wno-cast-qual -Wcast-align -Wwrite-strings -mno-tls-direct-seg-refs  -DGC_LINUX_THREADS -D_GNU_SOURCE -D_REENTRANT -DUSE_MMAP -DUSE_MUNMAP -D_FILE_OFFSET_BITS=64  conftest.c  -ldl -lpthread >&5
conftest.c:94: warning: function declaration isn't a prototype
conftest.c:104: warning: function declaration isn't a prototype
configure:29885: $? = 0
configure:29892: test -z "$ac_c_werror_flag" || test ! -s conftest.err
configure:29895: $? = 0
configure:29902: test -s conftest
configure:29905: $? = 0
configure:29919: result: yes
configure:29933: checking for pthread_attr_getstack
configure:29989: i686-pc-linux-gnu-gcc -o conftest -g -O2 -fno-strict-aliasing -Wdeclaration-after-statement -g -Wall -Wunused -Wmissing-prototypes -Wmissing-declarations -Wstrict-prototypes  -Wmissing-prototypes -Wnested-externs -Wpointer-arith -Wno-cast-qual -Wcast-align -Wwrite-strings -mno-tls-direct-seg-refs  -DGC_LINUX_THREADS -D_GNU_SOURCE -D_REENTRANT -DUSE_MMAP -DUSE_MUNMAP -D_FILE_OFFSET_BITS=64  conftest.c  -ldl -lpthread >&5
conftest.c:95: warning: function declaration isn't a prototype
conftest.c:105: warning: function declaration isn't a prototype
configure:29995: $? = 0
configure:30002: test -z "$ac_c_werror_flag" || test ! -s conftest.err
configure:30005: $? = 0
configure:30012: test -s conftest
configure:30015: $? = 0
configure:30029: result: yes
configure:30044: checking for pthread_get_stacksize_np
configure:30100: i686-pc-linux-gnu-gcc -o conftest -g -O2 -fno-strict-aliasing -Wdeclaration-after-statement -g -Wall -Wunused -Wmissing-prototypes -Wmissing-declarations -Wstrict-prototypes  -Wmissing-prototypes -Wnested-externs -Wpointer-arith -Wno-cast-qual -Wcast-align -Wwrite-strings -mno-tls-direct-seg-refs  -DGC_LINUX_THREADS -D_GNU_SOURCE -D_REENTRANT -DUSE_MMAP -DUSE_MUNMAP -D_FILE_OFFSET_BITS=64  conftest.c  -ldl -lpthread >&5
conftest.c:96: warning: function declaration isn't a prototype
conftest.c:106: warning: function declaration isn't a prototype
/tmp/ccwfzGcw.o: In function `main':
/usr/local/src/mono/conftest.c:107: undefined reference to `pthread_get_stacksize_np'
collect2: ld returned 1 exit status
configure:30106: $? = 1
configure: failed program was:
| /* confdefs.h.  */
| #define PACKAGE_NAME ""
| #define PACKAGE_TARNAME ""
| #define PACKAGE_VERSION ""
| #define PACKAGE_STRING ""
| #define PACKAGE_BUGREPORT ""
| #define PACKAGE "mono"
| #define VERSION "1.2"
| #define STDC_HEADERS 1
| #define HAVE_SYS_TYPES_H 1
| #define HAVE_SYS_STAT_H 1
| #define HAVE_STDLIB_H 1
| #define HAVE_STRING_H 1
| #define HAVE_MEMORY_H 1
| #define HAVE_STRINGS_H 1
| #define HAVE_INTTYPES_H 1
| #define HAVE_STDINT_H 1
| #define HAVE_UNISTD_H 1
| #define HAVE_DLFCN_H 1
| #define HAVE_NETDB_H 1
| #define HAVE_UTIME_H 1
| #define HAVE_SEMAPHORE_H 1
| #define HAVE_SYS_UN_H 1
| #define HAVE_LINUX_RTC_H 1
| #define HAVE_SYS_SYSCALL_H 1
| #define HAVE_ELF_H 1
| #define HAVE_POLL_H 1
| #define HAVE_SYS_POLL_H 1
| #define HAVE_SYS_WAIT_H 1
| #define HAVE_GRP_H 1
| #define HAVE_SYSLOG_H 1
| #define HAVE_WCHAR_H 1
| #define HAVE_ISINF 1
| #define SIZEOF_VOID_P 4
| #define MONO_XEN_OPT 1
| #define DISABLED_FEATURES "none"
| #define HAVE_BOEHM_GC 1
| #define HAVE_GC_H 1
| #define USE_INCLUDED_LIBGC 1
| #define HAVE_GC_GCJ_MALLOC 1
| #define HAVE_GC_ENABLE 1
| #define USED_GC_NAME "Included Boehm (with typed GC)"
| #define HAVE_DL_LOADER 1
| #define HAVE_EXECINFO_H 1
| #define HAVE_GETGRGID_R 1
| #define HAVE_GETGRNAM_R 1
| #define HAVE_GETPWNAM_R 1
| #define HAVE_GETPWUID_R 1
| #define HAVE_GETRESUID 1
| #define HAVE_SETRESUID 1
| #define HAVE_BACKTRACE_SYMBOLS 1
| #define HAVE_MKSTEMP 1
| #define HAVE_MMAP 1
| #define HAVE_MADVISE 1
| #define HAVE_LARGE_FILE_SUPPORT 1
| #define HAVE_MSG_NOSIGNAL 1
| #define HAVE_SOL_IP 1
| #define HAVE_SOL_IPV6 1
| #define HAVE_IP_PKTINFO 1
| #define HAVE_IPV6_PKTINFO 1
| #define HAVE_STRUCT_IP_MREQN 1
| #define HAVE_GETHOSTBYNAME2_R 1
| #define HAVE_INET_PTON 1
| #define HAVE_INET_ATON 1
| #define MONO_SIZEOF_SUNPATH 108
| #define MONO_ZERO_ARRAY_LENGTH 0
| #define HAVE_PTHREAD_H 1
| #define HAVE_PTHREAD_MUTEX_TIMEDLOCK 1
| #define HAVE_PTHREAD_GETATTR_NP 1
| #define HAVE_PTHREAD_ATTR_SETSTACKSIZE 1
| #define HAVE_PTHREAD_ATTR_GETSTACK 1
| /* end confdefs.h.  */
| /* Define pthread_get_stacksize_np to an innocuous variant, in case <limits.h> declares pthread_get_stacksize_np.
|    For example, HP-UX 11i <limits.h> declares gettimeofday.  */
| #define pthread_get_stacksize_np innocuous_pthread_get_stacksize_np
| 
| /* System header to define __stub macros and hopefully few prototypes,
|     which can conflict with char pthread_get_stacksize_np (); below.
|     Prefer <limits.h> to <assert.h> if __STDC__ is defined, since
|     <limits.h> exists even on freestanding compilers.  */
| 
| #ifdef __STDC__
| # include <limits.h>
| #else
| # include <assert.h>
| #endif
| 
| #undef pthread_get_stacksize_np
| 
| /* Override any GCC internal prototype to avoid an error.
|    Use char because int might match the return type of a GCC
|    builtin and then its argument prototype would still apply.  */
| #ifdef __cplusplus
| extern "C"
| #endif
| char pthread_get_stacksize_np ();
| /* The GNU C library defines this for functions which it implements
|     to always fail with ENOSYS.  Some functions are actually named
|     something starting with __ and the normal name is an alias.  */
| #if defined __stub_pthread_get_stacksize_np || defined __stub___pthread_get_stacksize_np
| choke me
| #endif
| 
| int
| main ()
| {
| return pthread_get_stacksize_np ();
|   ;
|   return 0;
| }
configure:30140: result: no
configure:30044: checking for pthread_get_stackaddr_np
configure:30100: i686-pc-linux-gnu-gcc -o conftest -g -O2 -fno-strict-aliasing -Wdeclaration-after-statement -g -Wall -Wunused -Wmissing-prototypes -Wmissing-declarations -Wstrict-prototypes  -Wmissing-prototypes -Wnested-externs -Wpointer-arith -Wno-cast-qual -Wcast-align -Wwrite-strings -mno-tls-direct-seg-refs  -DGC_LINUX_THREADS -D_GNU_SOURCE -D_REENTRANT -DUSE_MMAP -DUSE_MUNMAP -D_FILE_OFFSET_BITS=64  conftest.c  -ldl -lpthread >&5
conftest.c:96: warning: function declaration isn't a prototype
conftest.c:106: warning: function declaration isn't a prototype
/tmp/cceR58zP.o: In function `main':
/usr/local/src/mono/conftest.c:107: undefined reference to `pthread_get_stackaddr_np'
collect2: ld returned 1 exit status
configure:30106: $? = 1
configure: failed program was:
| /* confdefs.h.  */
| #define PACKAGE_NAME ""
| #define PACKAGE_TARNAME ""
| #define PACKAGE_VERSION ""
| #define PACKAGE_STRING ""
| #define PACKAGE_BUGREPORT ""
| #define PACKAGE "mono"
| #define VERSION "1.2"
| #define STDC_HEADERS 1
| #define HAVE_SYS_TYPES_H 1
| #define HAVE_SYS_STAT_H 1
| #define HAVE_STDLIB_H 1
| #define HAVE_STRING_H 1
| #define HAVE_MEMORY_H 1
| #define HAVE_STRINGS_H 1
| #define HAVE_INTTYPES_H 1
| #define HAVE_STDINT_H 1
| #define HAVE_UNISTD_H 1
| #define HAVE_DLFCN_H 1
| #define HAVE_NETDB_H 1
| #define HAVE_UTIME_H 1
| #define HAVE_SEMAPHORE_H 1
| #define HAVE_SYS_UN_H 1
| #define HAVE_LINUX_RTC_H 1
| #define HAVE_SYS_SYSCALL_H 1
| #define HAVE_ELF_H 1
| #define HAVE_POLL_H 1
| #define HAVE_SYS_POLL_H 1
| #define HAVE_SYS_WAIT_H 1
| #define HAVE_GRP_H 1
| #define HAVE_SYSLOG_H 1
| #define HAVE_WCHAR_H 1
| #define HAVE_ISINF 1
| #define SIZEOF_VOID_P 4
| #define MONO_XEN_OPT 1
| #define DISABLED_FEATURES "none"
| #define HAVE_BOEHM_GC 1
| #define HAVE_GC_H 1
| #define USE_INCLUDED_LIBGC 1
| #define HAVE_GC_GCJ_MALLOC 1
| #define HAVE_GC_ENABLE 1
| #define USED_GC_NAME "Included Boehm (with typed GC)"
| #define HAVE_DL_LOADER 1
| #define HAVE_EXECINFO_H 1
| #define HAVE_GETGRGID_R 1
| #define HAVE_GETGRNAM_R 1
| #define HAVE_GETPWNAM_R 1
| #define HAVE_GETPWUID_R 1
| #define HAVE_GETRESUID 1
| #define HAVE_SETRESUID 1
| #define HAVE_BACKTRACE_SYMBOLS 1
| #define HAVE_MKSTEMP 1
| #define HAVE_MMAP 1
| #define HAVE_MADVISE 1
| #define HAVE_LARGE_FILE_SUPPORT 1
| #define HAVE_MSG_NOSIGNAL 1
| #define HAVE_SOL_IP 1
| #define HAVE_SOL_IPV6 1
| #define HAVE_IP_PKTINFO 1
| #define HAVE_IPV6_PKTINFO 1
| #define HAVE_STRUCT_IP_MREQN 1
| #define HAVE_GETHOSTBYNAME2_R 1
| #define HAVE_INET_PTON 1
| #define HAVE_INET_ATON 1
| #define MONO_SIZEOF_SUNPATH 108
| #define MONO_ZERO_ARRAY_LENGTH 0
| #define HAVE_PTHREAD_H 1
| #define HAVE_PTHREAD_MUTEX_TIMEDLOCK 1
| #define HAVE_PTHREAD_GETATTR_NP 1
| #define HAVE_PTHREAD_ATTR_SETSTACKSIZE 1
| #define HAVE_PTHREAD_ATTR_GETSTACK 1
| /* end confdefs.h.  */
| /* Define pthread_get_stackaddr_np to an innocuous variant, in case <limits.h> declares pthread_get_stackaddr_np.
|    For example, HP-UX 11i <limits.h> declares gettimeofday.  */
| #define pthread_get_stackaddr_np innocuous_pthread_get_stackaddr_np
| 
| /* System header to define __stub macros and hopefully few prototypes,
|     which can conflict with char pthread_get_stackaddr_np (); below.
|     Prefer <limits.h> to <assert.h> if __STDC__ is defined, since
|     <limits.h> exists even on freestanding compilers.  */
| 
| #ifdef __STDC__
| # include <limits.h>
| #else
| # include <assert.h>
| #endif
| 
| #undef pthread_get_stackaddr_np
| 
| /* Override any GCC internal prototype to avoid an error.
|    Use char because int might match the return type of a GCC
|    builtin and then its argument prototype would still apply.  */
| #ifdef __cplusplus
| extern "C"
| #endif
| char pthread_get_stackaddr_np ();
| /* The GNU C library defines this for functions which it implements
|     to always fail with ENOSYS.  Some functions are actually named
|     something starting with __ and the normal name is an alias.  */
| #if defined __stub_pthread_get_stackaddr_np || defined __stub___pthread_get_stackaddr_np
| choke me
| #endif
| 
| int
| main ()
| {
| return pthread_get_stackaddr_np ();
|   ;
|   return 0;
| }
configure:30140: result: no
configure:30151: checking for working __thread
configure:30206: i686-pc-linux-gnu-gcc -o conftest -g -O2 -fno-strict-aliasing -Wdeclaration-after-statement -g -Wall -Wunused -Wmissing-prototypes -Wmissing-declarations -Wstrict-prototypes  -Wmissing-prototypes -Wnested-externs -Wpointer-arith -Wno-cast-qual -Wcast-align -Wwrite-strings -mno-tls-direct-seg-refs  -DGC_LINUX_THREADS -D_GNU_SOURCE -D_REENTRANT -DUSE_MMAP -DUSE_MUNMAP -D_FILE_OFFSET_BITS=64  conftest.c  -ldl -lpthread >&5
conftest.c:79: warning: no previous prototype for 'thread_main'
conftest.c: In function `thread_main':
conftest.c:80: warning: assignment makes integer from pointer without a cast
conftest.c:81: warning: implicit declaration of function `sleep'
conftest.c:81: warning: nested extern declaration of `sleep'
conftest.c:82: warning: comparison between pointer and integer
conftest.c:83: warning: comparison between pointer and integer
conftest.c:85: warning: comparison between pointer and integer
conftest.c: At top level:
conftest.c:88: warning: function declaration isn't a prototype
conftest.c: In function `main':
conftest.c:93: warning: passing arg 3 of `pthread_create' from incompatible pointer type
conftest.c:93: warning: passing arg 4 of `pthread_create' makes pointer from integer without a cast
conftest.c:94: warning: passing arg 3 of `pthread_create' from incompatible pointer type
conftest.c:94: warning: passing arg 4 of `pthread_create' makes pointer from integer without a cast
configure:30209: $? = 0
configure:30215: ./conftest
configure:30218: $? = 0
configure:30221: result: yes
configure:30242: checking for working sigaltstack
configure:30245: result: disabled
configure:30398: checking for library containing sem_init
configure:30439: i686-pc-linux-gnu-gcc -o conftest -g -O2 -fno-strict-aliasing -Wdeclaration-after-statement -g -Wall -Wunused -Wmissing-prototypes -Wmissing-declarations -Wstrict-prototypes  -Wmissing-prototypes -Wnested-externs -Wpointer-arith -Wno-cast-qual -Wcast-align -Wwrite-strings -mno-tls-direct-seg-refs  -DGC_LINUX_THREADS -D_GNU_SOURCE -D_REENTRANT -DUSE_MMAP -DUSE_MUNMAP -D_FILE_OFFSET_BITS=64  conftest.c  -ldl -lpthread >&5
conftest.c:80: warning: function declaration isn't a prototype
conftest.c:83: warning: function declaration isn't a prototype
configure:30445: $? = 0
configure:30452: test -z "$ac_c_werror_flag" || test ! -s conftest.err
configure:30455: $? = 0
configure:30462: test -s conftest
configure:30465: $? = 0
configure:30489: result: none required
configure:30498: checking for tm_gmtoff in struct tm
configure:30529: i686-pc-linux-gnu-gcc -c -g -O2 -fno-strict-aliasing -Wdeclaration-after-statement -g -Wall -Wunused -Wmissing-prototypes -Wmissing-declarations -Wstrict-prototypes  -Wmissing-prototypes -Wnested-externs -Wpointer-arith -Wno-cast-qual -Wcast-align -Wwrite-strings -mno-tls-direct-seg-refs  -DGC_LINUX_THREADS -D_GNU_SOURCE -D_REENTRANT -DUSE_MMAP -DUSE_MUNMAP -D_FILE_OFFSET_BITS=64 conftest.c >&5
conftest.c:78: warning: function declaration isn't a prototype
configure:30535: $? = 0
configure:30542: test -z "$ac_c_werror_flag" || test ! -s conftest.err
configure:30545: $? = 0
configure:30552: test -s conftest.o
configure:30555: $? = 0
configure:30567: result: yes
configure:30662: checking for finite
configure:30718: i686-pc-linux-gnu-gcc -o conftest -g -O2 -fno-strict-aliasing -Wdeclaration-after-statement -g -Wall -Wunused -Wmissing-prototypes -Wmissing-declarations -Wstrict-prototypes  -Wmissing-prototypes -Wnested-externs -Wpointer-arith -Wno-cast-qual -Wcast-align -Wwrite-strings -mno-tls-direct-seg-refs  -DGC_LINUX_THREADS -D_GNU_SOURCE -D_REENTRANT -DUSE_MMAP -DUSE_MUNMAP -D_FILE_OFFSET_BITS=64  conftest.c  -ldl -lpthread -lm >&5
conftest.c:97: warning: function declaration isn't a prototype
conftest.c:107: warning: function declaration isn't a prototype
configure:30724: $? = 0
configure:30731: test -z "$ac_c_werror_flag" || test ! -s conftest.err
configure:30734: $? = 0
configure:30741: test -s conftest
configure:30744: $? = 0
configure:30758: result: yes
configure:30839: checking for isfinite
configure:30895: i686-pc-linux-gnu-gcc -o conftest -g -O2 -fno-strict-aliasing -Wdeclaration-after-statement -g -Wall -Wunused -Wmissing-prototypes -Wmissing-declarations -Wstrict-prototypes  -Wmissing-prototypes -Wnested-externs -Wpointer-arith -Wno-cast-qual -Wcast-align -Wwrite-strings -mno-tls-direct-seg-refs  -DGC_LINUX_THREADS -D_GNU_SOURCE -D_REENTRANT -DUSE_MMAP -DUSE_MUNMAP -D_FILE_OFFSET_BITS=64  conftest.c  -ldl -lpthread -lm >&5
conftest.c:98: warning: function declaration isn't a prototype
conftest.c:108: warning: function declaration isn't a prototype
/tmp/ccQpZkJ6.o: In function `main':
/usr/local/src/mono/conftest.c:109: undefined reference to `isfinite'
collect2: ld returned 1 exit status
configure:30901: $? = 1
configure: failed program was:
| /* confdefs.h.  */
| #define PACKAGE_NAME ""
| #define PACKAGE_TARNAME ""
| #define PACKAGE_VERSION ""
| #define PACKAGE_STRING ""
| #define PACKAGE_BUGREPORT ""
| #define PACKAGE "mono"
| #define VERSION "1.2"
| #define STDC_HEADERS 1
| #define HAVE_SYS_TYPES_H 1
| #define HAVE_SYS_STAT_H 1
| #define HAVE_STDLIB_H 1
| #define HAVE_STRING_H 1
| #define HAVE_MEMORY_H 1
| #define HAVE_STRINGS_H 1
| #define HAVE_INTTYPES_H 1
| #define HAVE_STDINT_H 1
| #define HAVE_UNISTD_H 1
| #define HAVE_DLFCN_H 1
| #define HAVE_NETDB_H 1
| #define HAVE_UTIME_H 1
| #define HAVE_SEMAPHORE_H 1
| #define HAVE_SYS_UN_H 1
| #define HAVE_LINUX_RTC_H 1
| #define HAVE_SYS_SYSCALL_H 1
| #define HAVE_ELF_H 1
| #define HAVE_POLL_H 1
| #define HAVE_SYS_POLL_H 1
| #define HAVE_SYS_WAIT_H 1
| #define HAVE_GRP_H 1
| #define HAVE_SYSLOG_H 1
| #define HAVE_WCHAR_H 1
| #define HAVE_ISINF 1
| #define SIZEOF_VOID_P 4
| #define MONO_XEN_OPT 1
| #define DISABLED_FEATURES "none"
| #define HAVE_BOEHM_GC 1
| #define HAVE_GC_H 1
| #define USE_INCLUDED_LIBGC 1
| #define HAVE_GC_GCJ_MALLOC 1
| #define HAVE_GC_ENABLE 1
| #define USED_GC_NAME "Included Boehm (with typed GC)"
| #define HAVE_DL_LOADER 1
| #define HAVE_EXECINFO_H 1
| #define HAVE_GETGRGID_R 1
| #define HAVE_GETGRNAM_R 1
| #define HAVE_GETPWNAM_R 1
| #define HAVE_GETPWUID_R 1
| #define HAVE_GETRESUID 1
| #define HAVE_SETRESUID 1
| #define HAVE_BACKTRACE_SYMBOLS 1
| #define HAVE_MKSTEMP 1
| #define HAVE_MMAP 1
| #define HAVE_MADVISE 1
| #define HAVE_LARGE_FILE_SUPPORT 1
| #define HAVE_MSG_NOSIGNAL 1
| #define HAVE_SOL_IP 1
| #define HAVE_SOL_IPV6 1
| #define HAVE_IP_PKTINFO 1
| #define HAVE_IPV6_PKTINFO 1
| #define HAVE_STRUCT_IP_MREQN 1
| #define HAVE_GETHOSTBYNAME2_R 1
| #define HAVE_INET_PTON 1
| #define HAVE_INET_ATON 1
| #define MONO_SIZEOF_SUNPATH 108
| #define MONO_ZERO_ARRAY_LENGTH 0
| #define HAVE_PTHREAD_H 1
| #define HAVE_PTHREAD_MUTEX_TIMEDLOCK 1
| #define HAVE_PTHREAD_GETATTR_NP 1
| #define HAVE_PTHREAD_ATTR_SETSTACKSIZE 1
| #define HAVE_PTHREAD_ATTR_GETSTACK 1
| #define HAVE_TM_GMTOFF 1
| #define HAVE_FINITE 1
| /* end confdefs.h.  */
| /* Define isfinite to an innocuous variant, in case <limits.h> declares isfinite.
|    For example, HP-UX 11i <limits.h> declares gettimeofday.  */
| #define isfinite innocuous_isfinite
| 
| /* System header to define __stub macros and hopefully few prototypes,
|     which can conflict with char isfinite (); below.
|     Prefer <limits.h> to <assert.h> if __STDC__ is defined, since
|     <limits.h> exists even on freestanding compilers.  */
| 
| #ifdef __STDC__
| # include <limits.h>
| #else
| # include <assert.h>
| #endif
| 
| #undef isfinite
| 
| /* Override any GCC internal prototype to avoid an error.
|    Use char because int might match the return type of a GCC
|    builtin and then its argument prototype would still apply.  */
| #ifdef __cplusplus
| extern "C"
| #endif
| char isfinite ();
| /* The GNU C library defines this for functions which it implements
|     to always fail with ENOSYS.  Some functions are actually named
|     something starting with __ and the normal name is an alias.  */
| #if defined __stub_isfinite || defined __stub___isfinite
| choke me
| #endif
| 
| int
| main ()
| {
| return isfinite ();
|   ;
|   return 0;
| }
configure:30935: result: no
configure:30943: checking for isfinite in math.h
configure:30966: i686-pc-linux-gnu-gcc -o conftest -g -O2 -fno-strict-aliasing -Wdeclaration-after-statement -g -Wall -Wunused -Wmissing-prototypes -Wmissing-declarations -Wstrict-prototypes  -Wmissing-prototypes -Wnested-externs -Wpointer-arith -Wno-cast-qual -Wcast-align -Wwrite-strings -mno-tls-direct-seg-refs  -DGC_LINUX_THREADS -D_GNU_SOURCE -D_REENTRANT -DUSE_MMAP -DUSE_MUNMAP -D_FILE_OFFSET_BITS=64  conftest.c  -ldl -lpthread -lm >&5
conftest.c:78: warning: function declaration isn't a prototype
configure:30972: $? = 0
configure:30979: test -z "$ac_c_werror_flag" || test ! -s conftest.err
configure:30982: $? = 0
configure:30989: test -s conftest
configure:30992: $? = 0
configure:30997: result: yes
configure:31017: checking for poll
configure:31073: i686-pc-linux-gnu-gcc -o conftest -g -O2 -fno-strict-aliasing -Wdeclaration-after-statement -g -Wall -Wunused -Wmissing-prototypes -Wmissing-declarations -Wstrict-prototypes  -Wmissing-prototypes -Wnested-externs -Wpointer-arith -Wno-cast-qual -Wcast-align -Wwrite-strings -mno-tls-direct-seg-refs  -DGC_LINUX_THREADS -D_GNU_SOURCE -D_REENTRANT -DUSE_MMAP -DUSE_MUNMAP -D_FILE_OFFSET_BITS=64  conftest.c  -ldl -lpthread -lm >&5
conftest.c:99: warning: function declaration isn't a prototype
conftest.c:109: warning: function declaration isn't a prototype
configure:31079: $? = 0
configure:31086: test -z "$ac_c_werror_flag" || test ! -s conftest.err
configure:31089: $? = 0
configure:31096: test -s conftest
configure:31099: $? = 0
configure:31113: result: yes
configure:31124: checking for signbit
configure:31149: i686-pc-linux-gnu-gcc -o conftest -g -O2 -fno-strict-aliasing -Wdeclaration-after-statement -g -Wall -Wunused -Wmissing-prototypes -Wmissing-declarations -Wstrict-prototypes  -Wmissing-prototypes -Wnested-externs -Wpointer-arith -Wno-cast-qual -Wcast-align -Wwrite-strings -mno-tls-direct-seg-refs  -DGC_LINUX_THREADS -D_GNU_SOURCE -D_REENTRANT -DUSE_MMAP -DUSE_MUNMAP -D_FILE_OFFSET_BITS=64  conftest.c  -ldl -lpthread -lm >&5
conftest.c:80: warning: function declaration isn't a prototype
conftest.c: In function `main':
conftest.c:82: warning: unused variable `s'
configure:31155: $? = 0
configure:31162: test -z "$ac_c_werror_flag" || test ! -s conftest.err
configure:31165: $? = 0
configure:31172: test -s conftest
configure:31175: $? = 0
configure:31178: result: yes
configure:31213: checking sys/epoll.h usability
configure:31230: i686-pc-linux-gnu-gcc -c -g -O2 -fno-strict-aliasing -Wdeclaration-after-statement -g -Wall -Wunused -Wmissing-prototypes -Wmissing-declarations -Wstrict-prototypes  -Wmissing-prototypes -Wnested-externs -Wpointer-arith -Wno-cast-qual -Wcast-align -Wwrite-strings -mno-tls-direct-seg-refs  -DGC_LINUX_THREADS -D_GNU_SOURCE -D_REENTRANT -DUSE_MMAP -DUSE_MUNMAP -D_FILE_OFFSET_BITS=64 conftest.c >&5
configure:31236: $? = 0
configure:31243: test -z "$ac_c_werror_flag" || test ! -s conftest.err
configure:31246: $? = 0
configure:31253: test -s conftest.o
configure:31256: $? = 0
configure:31267: result: yes
configure:31271: checking sys/epoll.h presence
configure:31286: i686-pc-linux-gnu-gcc -E  -DGC_LINUX_THREADS -D_GNU_SOURCE -D_REENTRANT -DUSE_MMAP -DUSE_MUNMAP -D_FILE_OFFSET_BITS=64 conftest.c
configure:31292: $? = 0
configure:31313: result: yes
configure:31341: checking for sys/epoll.h
configure:31349: result: yes
configure:31367: checking for epoll_ctl
configure:31423: i686-pc-linux-gnu-gcc -o conftest -g -O2 -fno-strict-aliasing -Wdeclaration-after-statement -g -Wall -Wunused -Wmissing-prototypes -Wmissing-declarations -Wstrict-prototypes  -Wmissing-prototypes -Wnested-externs -Wpointer-arith -Wno-cast-qual -Wcast-align -Wwrite-strings -mno-tls-direct-seg-refs  -DGC_LINUX_THREADS -D_GNU_SOURCE -D_REENTRANT -DUSE_MMAP -DUSE_MUNMAP -D_FILE_OFFSET_BITS=64  conftest.c  -ldl -lpthread -lm >&5
conftest.c:102: warning: function declaration isn't a prototype
conftest.c:112: warning: function declaration isn't a prototype
configure:31429: $? = 0
configure:31436: test -z "$ac_c_werror_flag" || test ! -s conftest.err
configure:31439: $? = 0
configure:31446: test -s conftest
configure:31449: $? = 0
configure:31463: result: yes
configure:31496: checking sys/ioctl.h usability
configure:31513: i686-pc-linux-gnu-gcc -c -g -O2 -fno-strict-aliasing -Wdeclaration-after-statement -g -Wall -Wunused -Wmissing-prototypes -Wmissing-declarations -Wstrict-prototypes  -Wmissing-prototypes -Wnested-externs -Wpointer-arith -Wno-cast-qual -Wcast-align -Wwrite-strings -mno-tls-direct-seg-refs  -DGC_LINUX_THREADS -D_GNU_SOURCE -D_REENTRANT -DUSE_MMAP -DUSE_MUNMAP -D_FILE_OFFSET_BITS=64 conftest.c >&5
configure:31519: $? = 0
configure:31526: test -z "$ac_c_werror_flag" || test ! -s conftest.err
configure:31529: $? = 0
configure:31536: test -s conftest.o
configure:31539: $? = 0
configure:31550: result: yes
configure:31554: checking sys/ioctl.h presence
configure:31569: i686-pc-linux-gnu-gcc -E  -DGC_LINUX_THREADS -D_GNU_SOURCE -D_REENTRANT -DUSE_MMAP -DUSE_MUNMAP -D_FILE_OFFSET_BITS=64 conftest.c
configure:31575: $? = 0
configure:31596: result: yes
configure:31624: checking for sys/ioctl.h
configure:31632: result: yes
configure:31660: checking net/if.h usability
configure:31677: i686-pc-linux-gnu-gcc -c -g -O2 -fno-strict-aliasing -Wdeclaration-after-statement -g -Wall -Wunused -Wmissing-prototypes -Wmissing-declarations -Wstrict-prototypes  -Wmissing-prototypes -Wnested-externs -Wpointer-arith -Wno-cast-qual -Wcast-align -Wwrite-strings -mno-tls-direct-seg-refs  -DGC_LINUX_THREADS -D_GNU_SOURCE -D_REENTRANT -DUSE_MMAP -DUSE_MUNMAP -D_FILE_OFFSET_BITS=64 conftest.c >&5
configure:31683: $? = 0
configure:31690: test -z "$ac_c_werror_flag" || test ! -s conftest.err
configure:31693: $? = 0
configure:31700: test -s conftest.o
configure:31703: $? = 0
configure:31714: result: yes
configure:31718: checking net/if.h presence
configure:31733: i686-pc-linux-gnu-gcc -E  -DGC_LINUX_THREADS -D_GNU_SOURCE -D_REENTRANT -DUSE_MMAP -DUSE_MUNMAP -D_FILE_OFFSET_BITS=64 conftest.c
configure:31739: $? = 0
configure:31760: result: yes
configure:31788: checking for net/if.h
configure:31796: result: yes
configure:31809: checking for ifreq
configure:31842: i686-pc-linux-gnu-gcc -c -g -O2 -fno-strict-aliasing -Wdeclaration-after-statement -g -Wall -Wunused -Wmissing-prototypes -Wmissing-declarations -Wstrict-prototypes  -Wmissing-prototypes -Wnested-externs -Wpointer-arith -Wno-cast-qual -Wcast-align -Wwrite-strings -mno-tls-direct-seg-refs  -DGC_LINUX_THREADS -D_GNU_SOURCE -D_REENTRANT -DUSE_MMAP -DUSE_MUNMAP -D_FILE_OFFSET_BITS=64 conftest.c >&5
conftest.c:89: warning: function declaration isn't a prototype
configure:31848: $? = 0
configure:31855: test -z "$ac_c_werror_flag" || test ! -s conftest.err
configure:31858: $? = 0
configure:31865: test -s conftest.o
configure:31868: $? = 0
configure:31871: result: yes
configure:31905: checking checklist.h usability
configure:31922: i686-pc-linux-gnu-gcc -c -g -O2 -fno-strict-aliasing -Wdeclaration-after-statement -g -Wall -Wunused -Wmissing-prototypes -Wmissing-declarations -Wstrict-prototypes  -Wmissing-prototypes -Wnested-externs -Wpointer-arith -Wno-cast-qual -Wcast-align -Wwrite-strings -mno-tls-direct-seg-refs  -DGC_LINUX_THREADS -D_GNU_SOURCE -D_REENTRANT -DUSE_MMAP -DUSE_MUNMAP -D_FILE_OFFSET_BITS=64 conftest.c >&5
conftest.c:117:23: checklist.h: No such file or directory
configure:31928: $? = 1
configure: failed program was:
| /* confdefs.h.  */
| #define PACKAGE_NAME ""
| #define PACKAGE_TARNAME ""
| #define PACKAGE_VERSION ""
| #define PACKAGE_STRING ""
| #define PACKAGE_BUGREPORT ""
| #define PACKAGE "mono"
| #define VERSION "1.2"
| #define STDC_HEADERS 1
| #define HAVE_SYS_TYPES_H 1
| #define HAVE_SYS_STAT_H 1
| #define HAVE_STDLIB_H 1
| #define HAVE_STRING_H 1
| #define HAVE_MEMORY_H 1
| #define HAVE_STRINGS_H 1
| #define HAVE_INTTYPES_H 1
| #define HAVE_STDINT_H 1
| #define HAVE_UNISTD_H 1
| #define HAVE_DLFCN_H 1
| #define HAVE_NETDB_H 1
| #define HAVE_UTIME_H 1
| #define HAVE_SEMAPHORE_H 1
| #define HAVE_SYS_UN_H 1
| #define HAVE_LINUX_RTC_H 1
| #define HAVE_SYS_SYSCALL_H 1
| #define HAVE_ELF_H 1
| #define HAVE_POLL_H 1
| #define HAVE_SYS_POLL_H 1
| #define HAVE_SYS_WAIT_H 1
| #define HAVE_GRP_H 1
| #define HAVE_SYSLOG_H 1
| #define HAVE_WCHAR_H 1
| #define HAVE_ISINF 1
| #define SIZEOF_VOID_P 4
| #define MONO_XEN_OPT 1
| #define DISABLED_FEATURES "none"
| #define HAVE_BOEHM_GC 1
| #define HAVE_GC_H 1
| #define USE_INCLUDED_LIBGC 1
| #define HAVE_GC_GCJ_MALLOC 1
| #define HAVE_GC_ENABLE 1
| #define USED_GC_NAME "Included Boehm (with typed GC)"
| #define HAVE_DL_LOADER 1
| #define HAVE_EXECINFO_H 1
| #define HAVE_GETGRGID_R 1
| #define HAVE_GETGRNAM_R 1
| #define HAVE_GETPWNAM_R 1
| #define HAVE_GETPWUID_R 1
| #define HAVE_GETRESUID 1
| #define HAVE_SETRESUID 1
| #define HAVE_BACKTRACE_SYMBOLS 1
| #define HAVE_MKSTEMP 1
| #define HAVE_MMAP 1
| #define HAVE_MADVISE 1
| #define HAVE_LARGE_FILE_SUPPORT 1
| #define HAVE_MSG_NOSIGNAL 1
| #define HAVE_SOL_IP 1
| #define HAVE_SOL_IPV6 1
| #define HAVE_IP_PKTINFO 1
| #define HAVE_IPV6_PKTINFO 1
| #define HAVE_STRUCT_IP_MREQN 1
| #define HAVE_GETHOSTBYNAME2_R 1
| #define HAVE_INET_PTON 1
| #define HAVE_INET_ATON 1
| #define MONO_SIZEOF_SUNPATH 108
| #define MONO_ZERO_ARRAY_LENGTH 0
| #define HAVE_PTHREAD_H 1
| #define HAVE_PTHREAD_MUTEX_TIMEDLOCK 1
| #define HAVE_PTHREAD_GETATTR_NP 1
| #define HAVE_PTHREAD_ATTR_SETSTACKSIZE 1
| #define HAVE_PTHREAD_ATTR_GETSTACK 1
| #define HAVE_TM_GMTOFF 1
| #define HAVE_FINITE 1
| #define HAVE_ISFINITE 1
| #define HAVE_POLL 1
| #define HAVE_SIGNBIT 1
| #define HAVE_SYS_EPOLL_H 1
| #define HAVE_EPOLL_CTL 1
| #define HAVE_EPOLL 1
| #define HAVE_SYS_IOCTL_H 1
| #define HAVE_NET_IF_H 1
| #define HAVE_SIOCGIFCONF 1
| /* end confdefs.h.  */
| #include <stdio.h>
| #if HAVE_SYS_TYPES_H
| # include <sys/types.h>
| #endif
| #if HAVE_SYS_STAT_H
| # include <sys/stat.h>
| #endif
| #if STDC_HEADERS
| # include <stdlib.h>
| # include <stddef.h>
| #else
| # if HAVE_STDLIB_H
| #  include <stdlib.h>
| # endif
| #endif
| #if HAVE_STRING_H
| # if !STDC_HEADERS && HAVE_MEMORY_H
| #  include <memory.h>
| # endif
| # include <string.h>
| #endif
| #if HAVE_STRINGS_H
| # include <strings.h>
| #endif
| #if HAVE_INTTYPES_H
| # include <inttypes.h>
| #endif
| #if HAVE_STDINT_H
| # include <stdint.h>
| #endif
| #if HAVE_UNISTD_H
| # include <unistd.h>
| #endif
| #include <checklist.h>
configure:31959: result: no
configure:31963: checking checklist.h presence
configure:31978: i686-pc-linux-gnu-gcc -E  -DGC_LINUX_THREADS -D_GNU_SOURCE -D_REENTRANT -DUSE_MMAP -DUSE_MUNMAP -D_FILE_OFFSET_BITS=64 conftest.c
conftest.c:84:23: checklist.h: No such file or directory
configure:31984: $? = 1
configure: failed program was:
| /* confdefs.h.  */
| #define PACKAGE_NAME ""
| #define PACKAGE_TARNAME ""
| #define PACKAGE_VERSION ""
| #define PACKAGE_STRING ""
| #define PACKAGE_BUGREPORT ""
| #define PACKAGE "mono"
| #define VERSION "1.2"
| #define STDC_HEADERS 1
| #define HAVE_SYS_TYPES_H 1
| #define HAVE_SYS_STAT_H 1
| #define HAVE_STDLIB_H 1
| #define HAVE_STRING_H 1
| #define HAVE_MEMORY_H 1
| #define HAVE_STRINGS_H 1
| #define HAVE_INTTYPES_H 1
| #define HAVE_STDINT_H 1
| #define HAVE_UNISTD_H 1
| #define HAVE_DLFCN_H 1
| #define HAVE_NETDB_H 1
| #define HAVE_UTIME_H 1
| #define HAVE_SEMAPHORE_H 1
| #define HAVE_SYS_UN_H 1
| #define HAVE_LINUX_RTC_H 1
| #define HAVE_SYS_SYSCALL_H 1
| #define HAVE_ELF_H 1
| #define HAVE_POLL_H 1
| #define HAVE_SYS_POLL_H 1
| #define HAVE_SYS_WAIT_H 1
| #define HAVE_GRP_H 1
| #define HAVE_SYSLOG_H 1
| #define HAVE_WCHAR_H 1
| #define HAVE_ISINF 1
| #define SIZEOF_VOID_P 4
| #define MONO_XEN_OPT 1
| #define DISABLED_FEATURES "none"
| #define HAVE_BOEHM_GC 1
| #define HAVE_GC_H 1
| #define USE_INCLUDED_LIBGC 1
| #define HAVE_GC_GCJ_MALLOC 1
| #define HAVE_GC_ENABLE 1
| #define USED_GC_NAME "Included Boehm (with typed GC)"
| #define HAVE_DL_LOADER 1
| #define HAVE_EXECINFO_H 1
| #define HAVE_GETGRGID_R 1
| #define HAVE_GETGRNAM_R 1
| #define HAVE_GETPWNAM_R 1
| #define HAVE_GETPWUID_R 1
| #define HAVE_GETRESUID 1
| #define HAVE_SETRESUID 1
| #define HAVE_BACKTRACE_SYMBOLS 1
| #define HAVE_MKSTEMP 1
| #define HAVE_MMAP 1
| #define HAVE_MADVISE 1
| #define HAVE_LARGE_FILE_SUPPORT 1
| #define HAVE_MSG_NOSIGNAL 1
| #define HAVE_SOL_IP 1
| #define HAVE_SOL_IPV6 1
| #define HAVE_IP_PKTINFO 1
| #define HAVE_IPV6_PKTINFO 1
| #define HAVE_STRUCT_IP_MREQN 1
| #define HAVE_GETHOSTBYNAME2_R 1
| #define HAVE_INET_PTON 1
| #define HAVE_INET_ATON 1
| #define MONO_SIZEOF_SUNPATH 108
| #define MONO_ZERO_ARRAY_LENGTH 0
| #define HAVE_PTHREAD_H 1
| #define HAVE_PTHREAD_MUTEX_TIMEDLOCK 1
| #define HAVE_PTHREAD_GETATTR_NP 1
| #define HAVE_PTHREAD_ATTR_SETSTACKSIZE 1
| #define HAVE_PTHREAD_ATTR_GETSTACK 1
| #define HAVE_TM_GMTOFF 1
| #define HAVE_FINITE 1
| #define HAVE_ISFINITE 1
| #define HAVE_POLL 1
| #define HAVE_SIGNBIT 1
| #define HAVE_SYS_EPOLL_H 1
| #define HAVE_EPOLL_CTL 1
| #define HAVE_EPOLL 1
| #define HAVE_SYS_IOCTL_H 1
| #define HAVE_NET_IF_H 1
| #define HAVE_SIOCGIFCONF 1
| /* end confdefs.h.  */
| #include <checklist.h>
configure:32005: result: no
configure:32033: checking for checklist.h
configure:32041: result: no
configure:32069: checking fstab.h usability
configure:32086: i686-pc-linux-gnu-gcc -c -g -O2 -fno-strict-aliasing -Wdeclaration-after-statement -g -Wall -Wunused -Wmissing-prototypes -Wmissing-declarations -Wstrict-prototypes  -Wmissing-prototypes -Wnested-externs -Wpointer-arith -Wno-cast-qual -Wcast-align -Wwrite-strings -mno-tls-direct-seg-refs  -DGC_LINUX_THREADS -D_GNU_SOURCE -D_REENTRANT -DUSE_MMAP -DUSE_MUNMAP -D_FILE_OFFSET_BITS=64 conftest.c >&5
configure:32092: $? = 0
configure:32099: test -z "$ac_c_werror_flag" || test ! -s conftest.err
configure:32102: $? = 0
configure:32109: test -s conftest.o
configure:32112: $? = 0
configure:32123: result: yes
configure:32127: checking fstab.h presence
configure:32142: i686-pc-linux-gnu-gcc -E  -DGC_LINUX_THREADS -D_GNU_SOURCE -D_REENTRANT -DUSE_MMAP -DUSE_MUNMAP -D_FILE_OFFSET_BITS=64 conftest.c
configure:32148: $? = 0
configure:32169: result: yes
configure:32197: checking for fstab.h
configure:32205: result: yes
configure:32233: checking attr/xattr.h usability
configure:32250: i686-pc-linux-gnu-gcc -c -g -O2 -fno-strict-aliasing -Wdeclaration-after-statement -g -Wall -Wunused -Wmissing-prototypes -Wmissing-declarations -Wstrict-prototypes  -Wmissing-prototypes -Wnested-externs -Wpointer-arith -Wno-cast-qual -Wcast-align -Wwrite-strings -mno-tls-direct-seg-refs  -DGC_LINUX_THREADS -D_GNU_SOURCE -D_REENTRANT -DUSE_MMAP -DUSE_MUNMAP -D_FILE_OFFSET_BITS=64 conftest.c >&5
conftest.c:118:24: attr/xattr.h: No such file or directory
configure:32256: $? = 1
configure: failed program was:
| /* confdefs.h.  */
| #define PACKAGE_NAME ""
| #define PACKAGE_TARNAME ""
| #define PACKAGE_VERSION ""
| #define PACKAGE_STRING ""
| #define PACKAGE_BUGREPORT ""
| #define PACKAGE "mono"
| #define VERSION "1.2"
| #define STDC_HEADERS 1
| #define HAVE_SYS_TYPES_H 1
| #define HAVE_SYS_STAT_H 1
| #define HAVE_STDLIB_H 1
| #define HAVE_STRING_H 1
| #define HAVE_MEMORY_H 1
| #define HAVE_STRINGS_H 1
| #define HAVE_INTTYPES_H 1
| #define HAVE_STDINT_H 1
| #define HAVE_UNISTD_H 1
| #define HAVE_DLFCN_H 1
| #define HAVE_NETDB_H 1
| #define HAVE_UTIME_H 1
| #define HAVE_SEMAPHORE_H 1
| #define HAVE_SYS_UN_H 1
| #define HAVE_LINUX_RTC_H 1
| #define HAVE_SYS_SYSCALL_H 1
| #define HAVE_ELF_H 1
| #define HAVE_POLL_H 1
| #define HAVE_SYS_POLL_H 1
| #define HAVE_SYS_WAIT_H 1
| #define HAVE_GRP_H 1
| #define HAVE_SYSLOG_H 1
| #define HAVE_WCHAR_H 1
| #define HAVE_ISINF 1
| #define SIZEOF_VOID_P 4
| #define MONO_XEN_OPT 1
| #define DISABLED_FEATURES "none"
| #define HAVE_BOEHM_GC 1
| #define HAVE_GC_H 1
| #define USE_INCLUDED_LIBGC 1
| #define HAVE_GC_GCJ_MALLOC 1
| #define HAVE_GC_ENABLE 1
| #define USED_GC_NAME "Included Boehm (with typed GC)"
| #define HAVE_DL_LOADER 1
| #define HAVE_EXECINFO_H 1
| #define HAVE_GETGRGID_R 1
| #define HAVE_GETGRNAM_R 1
| #define HAVE_GETPWNAM_R 1
| #define HAVE_GETPWUID_R 1
| #define HAVE_GETRESUID 1
| #define HAVE_SETRESUID 1
| #define HAVE_BACKTRACE_SYMBOLS 1
| #define HAVE_MKSTEMP 1
| #define HAVE_MMAP 1
| #define HAVE_MADVISE 1
| #define HAVE_LARGE_FILE_SUPPORT 1
| #define HAVE_MSG_NOSIGNAL 1
| #define HAVE_SOL_IP 1
| #define HAVE_SOL_IPV6 1
| #define HAVE_IP_PKTINFO 1
| #define HAVE_IPV6_PKTINFO 1
| #define HAVE_STRUCT_IP_MREQN 1
| #define HAVE_GETHOSTBYNAME2_R 1
| #define HAVE_INET_PTON 1
| #define HAVE_INET_ATON 1
| #define MONO_SIZEOF_SUNPATH 108
| #define MONO_ZERO_ARRAY_LENGTH 0
| #define HAVE_PTHREAD_H 1
| #define HAVE_PTHREAD_MUTEX_TIMEDLOCK 1
| #define HAVE_PTHREAD_GETATTR_NP 1
| #define HAVE_PTHREAD_ATTR_SETSTACKSIZE 1
| #define HAVE_PTHREAD_ATTR_GETSTACK 1
| #define HAVE_TM_GMTOFF 1
| #define HAVE_FINITE 1
| #define HAVE_ISFINITE 1
| #define HAVE_POLL 1
| #define HAVE_SIGNBIT 1
| #define HAVE_SYS_EPOLL_H 1
| #define HAVE_EPOLL_CTL 1
| #define HAVE_EPOLL 1
| #define HAVE_SYS_IOCTL_H 1
| #define HAVE_NET_IF_H 1
| #define HAVE_SIOCGIFCONF 1
| #define HAVE_FSTAB_H 1
| /* end confdefs.h.  */
| #include <stdio.h>
| #if HAVE_SYS_TYPES_H
| # include <sys/types.h>
| #endif
| #if HAVE_SYS_STAT_H
| # include <sys/stat.h>
| #endif
| #if STDC_HEADERS
| # include <stdlib.h>
| # include <stddef.h>
| #else
| # if HAVE_STDLIB_H
| #  include <stdlib.h>
| # endif
| #endif
| #if HAVE_STRING_H
| # if !STDC_HEADERS && HAVE_MEMORY_H
| #  include <memory.h>
| # endif
| # include <string.h>
| #endif
| #if HAVE_STRINGS_H
| # include <strings.h>
| #endif
| #if HAVE_INTTYPES_H
| # include <inttypes.h>
| #endif
| #if HAVE_STDINT_H
| # include <stdint.h>
| #endif
| #if HAVE_UNISTD_H
| # include <unistd.h>
| #endif
| #include <attr/xattr.h>
configure:32287: result: no
configure:32291: checking attr/xattr.h presence
configure:32306: i686-pc-linux-gnu-gcc -E  -DGC_LINUX_THREADS -D_GNU_SOURCE -D_REENTRANT -DUSE_MMAP -DUSE_MUNMAP -D_FILE_OFFSET_BITS=64 conftest.c
conftest.c:85:24: attr/xattr.h: No such file or directory
configure:32312: $? = 1
configure: failed program was:
| /* confdefs.h.  */
| #define PACKAGE_NAME ""
| #define PACKAGE_TARNAME ""
| #define PACKAGE_VERSION ""
| #define PACKAGE_STRING ""
| #define PACKAGE_BUGREPORT ""
| #define PACKAGE "mono"
| #define VERSION "1.2"
| #define STDC_HEADERS 1
| #define HAVE_SYS_TYPES_H 1
| #define HAVE_SYS_STAT_H 1
| #define HAVE_STDLIB_H 1
| #define HAVE_STRING_H 1
| #define HAVE_MEMORY_H 1
| #define HAVE_STRINGS_H 1
| #define HAVE_INTTYPES_H 1
| #define HAVE_STDINT_H 1
| #define HAVE_UNISTD_H 1
| #define HAVE_DLFCN_H 1
| #define HAVE_NETDB_H 1
| #define HAVE_UTIME_H 1
| #define HAVE_SEMAPHORE_H 1
| #define HAVE_SYS_UN_H 1
| #define HAVE_LINUX_RTC_H 1
| #define HAVE_SYS_SYSCALL_H 1
| #define HAVE_ELF_H 1
| #define HAVE_POLL_H 1
| #define HAVE_SYS_POLL_H 1
| #define HAVE_SYS_WAIT_H 1
| #define HAVE_GRP_H 1
| #define HAVE_SYSLOG_H 1
| #define HAVE_WCHAR_H 1
| #define HAVE_ISINF 1
| #define SIZEOF_VOID_P 4
| #define MONO_XEN_OPT 1
| #define DISABLED_FEATURES "none"
| #define HAVE_BOEHM_GC 1
| #define HAVE_GC_H 1
| #define USE_INCLUDED_LIBGC 1
| #define HAVE_GC_GCJ_MALLOC 1
| #define HAVE_GC_ENABLE 1
| #define USED_GC_NAME "Included Boehm (with typed GC)"
| #define HAVE_DL_LOADER 1
| #define HAVE_EXECINFO_H 1
| #define HAVE_GETGRGID_R 1
| #define HAVE_GETGRNAM_R 1
| #define HAVE_GETPWNAM_R 1
| #define HAVE_GETPWUID_R 1
| #define HAVE_GETRESUID 1
| #define HAVE_SETRESUID 1
| #define HAVE_BACKTRACE_SYMBOLS 1
| #define HAVE_MKSTEMP 1
| #define HAVE_MMAP 1
| #define HAVE_MADVISE 1
| #define HAVE_LARGE_FILE_SUPPORT 1
| #define HAVE_MSG_NOSIGNAL 1
| #define HAVE_SOL_IP 1
| #define HAVE_SOL_IPV6 1
| #define HAVE_IP_PKTINFO 1
| #define HAVE_IPV6_PKTINFO 1
| #define HAVE_STRUCT_IP_MREQN 1
| #define HAVE_GETHOSTBYNAME2_R 1
| #define HAVE_INET_PTON 1
| #define HAVE_INET_ATON 1
| #define MONO_SIZEOF_SUNPATH 108
| #define MONO_ZERO_ARRAY_LENGTH 0
| #define HAVE_PTHREAD_H 1
| #define HAVE_PTHREAD_MUTEX_TIMEDLOCK 1
| #define HAVE_PTHREAD_GETATTR_NP 1
| #define HAVE_PTHREAD_ATTR_SETSTACKSIZE 1
| #define HAVE_PTHREAD_ATTR_GETSTACK 1
| #define HAVE_TM_GMTOFF 1
| #define HAVE_FINITE 1
| #define HAVE_ISFINITE 1
| #define HAVE_POLL 1
| #define HAVE_SIGNBIT 1
| #define HAVE_SYS_EPOLL_H 1
| #define HAVE_EPOLL_CTL 1
| #define HAVE_EPOLL 1
| #define HAVE_SYS_IOCTL_H 1
| #define HAVE_NET_IF_H 1
| #define HAVE_SIOCGIFCONF 1
| #define HAVE_FSTAB_H 1
| /* end confdefs.h.  */
| #include <attr/xattr.h>
configure:32333: result: no
configure:32361: checking for attr/xattr.h
configure:32369: result: no
configure:32397: checking sys/extattr.h usability
configure:32414: i686-pc-linux-gnu-gcc -c -g -O2 -fno-strict-aliasing -Wdeclaration-after-statement -g -Wall -Wunused -Wmissing-prototypes -Wmissing-declarations -Wstrict-prototypes  -Wmissing-prototypes -Wnested-externs -Wpointer-arith -Wno-cast-qual -Wcast-align -Wwrite-strings -mno-tls-direct-seg-refs  -DGC_LINUX_THREADS -D_GNU_SOURCE -D_REENTRANT -DUSE_MMAP -DUSE_MUNMAP -D_FILE_OFFSET_BITS=64 conftest.c >&5
conftest.c:118:25: sys/extattr.h: No such file or directory
configure:32420: $? = 1
configure: failed program was:
| /* confdefs.h.  */
| #define PACKAGE_NAME ""
| #define PACKAGE_TARNAME ""
| #define PACKAGE_VERSION ""
| #define PACKAGE_STRING ""
| #define PACKAGE_BUGREPORT ""
| #define PACKAGE "mono"
| #define VERSION "1.2"
| #define STDC_HEADERS 1
| #define HAVE_SYS_TYPES_H 1
| #define HAVE_SYS_STAT_H 1
| #define HAVE_STDLIB_H 1
| #define HAVE_STRING_H 1
| #define HAVE_MEMORY_H 1
| #define HAVE_STRINGS_H 1
| #define HAVE_INTTYPES_H 1
| #define HAVE_STDINT_H 1
| #define HAVE_UNISTD_H 1
| #define HAVE_DLFCN_H 1
| #define HAVE_NETDB_H 1
| #define HAVE_UTIME_H 1
| #define HAVE_SEMAPHORE_H 1
| #define HAVE_SYS_UN_H 1
| #define HAVE_LINUX_RTC_H 1
| #define HAVE_SYS_SYSCALL_H 1
| #define HAVE_ELF_H 1
| #define HAVE_POLL_H 1
| #define HAVE_SYS_POLL_H 1
| #define HAVE_SYS_WAIT_H 1
| #define HAVE_GRP_H 1
| #define HAVE_SYSLOG_H 1
| #define HAVE_WCHAR_H 1
| #define HAVE_ISINF 1
| #define SIZEOF_VOID_P 4
| #define MONO_XEN_OPT 1
| #define DISABLED_FEATURES "none"
| #define HAVE_BOEHM_GC 1
| #define HAVE_GC_H 1
| #define USE_INCLUDED_LIBGC 1
| #define HAVE_GC_GCJ_MALLOC 1
| #define HAVE_GC_ENABLE 1
| #define USED_GC_NAME "Included Boehm (with typed GC)"
| #define HAVE_DL_LOADER 1
| #define HAVE_EXECINFO_H 1
| #define HAVE_GETGRGID_R 1
| #define HAVE_GETGRNAM_R 1
| #define HAVE_GETPWNAM_R 1
| #define HAVE_GETPWUID_R 1
| #define HAVE_GETRESUID 1
| #define HAVE_SETRESUID 1
| #define HAVE_BACKTRACE_SYMBOLS 1
| #define HAVE_MKSTEMP 1
| #define HAVE_MMAP 1
| #define HAVE_MADVISE 1
| #define HAVE_LARGE_FILE_SUPPORT 1
| #define HAVE_MSG_NOSIGNAL 1
| #define HAVE_SOL_IP 1
| #define HAVE_SOL_IPV6 1
| #define HAVE_IP_PKTINFO 1
| #define HAVE_IPV6_PKTINFO 1
| #define HAVE_STRUCT_IP_MREQN 1
| #define HAVE_GETHOSTBYNAME2_R 1
| #define HAVE_INET_PTON 1
| #define HAVE_INET_ATON 1
| #define MONO_SIZEOF_SUNPATH 108
| #define MONO_ZERO_ARRAY_LENGTH 0
| #define HAVE_PTHREAD_H 1
| #define HAVE_PTHREAD_MUTEX_TIMEDLOCK 1
| #define HAVE_PTHREAD_GETATTR_NP 1
| #define HAVE_PTHREAD_ATTR_SETSTACKSIZE 1
| #define HAVE_PTHREAD_ATTR_GETSTACK 1
| #define HAVE_TM_GMTOFF 1
| #define HAVE_FINITE 1
| #define HAVE_ISFINITE 1
| #define HAVE_POLL 1
| #define HAVE_SIGNBIT 1
| #define HAVE_SYS_EPOLL_H 1
| #define HAVE_EPOLL_CTL 1
| #define HAVE_EPOLL 1
| #define HAVE_SYS_IOCTL_H 1
| #define HAVE_NET_IF_H 1
| #define HAVE_SIOCGIFCONF 1
| #define HAVE_FSTAB_H 1
| /* end confdefs.h.  */
| #include <stdio.h>
| #if HAVE_SYS_TYPES_H
| # include <sys/types.h>
| #endif
| #if HAVE_SYS_STAT_H
| # include <sys/stat.h>
| #endif
| #if STDC_HEADERS
| # include <stdlib.h>
| # include <stddef.h>
| #else
| # if HAVE_STDLIB_H
| #  include <stdlib.h>
| # endif
| #endif
| #if HAVE_STRING_H
| # if !STDC_HEADERS && HAVE_MEMORY_H
| #  include <memory.h>
| # endif
| # include <string.h>
| #endif
| #if HAVE_STRINGS_H
| # include <strings.h>
| #endif
| #if HAVE_INTTYPES_H
| # include <inttypes.h>
| #endif
| #if HAVE_STDINT_H
| # include <stdint.h>
| #endif
| #if HAVE_UNISTD_H
| # include <unistd.h>
| #endif
| #include <sys/extattr.h>
configure:32451: result: no
configure:32455: checking sys/extattr.h presence
configure:32470: i686-pc-linux-gnu-gcc -E  -DGC_LINUX_THREADS -D_GNU_SOURCE -D_REENTRANT -DUSE_MMAP -DUSE_MUNMAP -D_FILE_OFFSET_BITS=64 conftest.c
conftest.c:85:25: sys/extattr.h: No such file or directory
configure:32476: $? = 1
configure: failed program was:
| /* confdefs.h.  */
| #define PACKAGE_NAME ""
| #define PACKAGE_TARNAME ""
| #define PACKAGE_VERSION ""
| #define PACKAGE_STRING ""
| #define PACKAGE_BUGREPORT ""
| #define PACKAGE "mono"
| #define VERSION "1.2"
| #define STDC_HEADERS 1
| #define HAVE_SYS_TYPES_H 1
| #define HAVE_SYS_STAT_H 1
| #define HAVE_STDLIB_H 1
| #define HAVE_STRING_H 1
| #define HAVE_MEMORY_H 1
| #define HAVE_STRINGS_H 1
| #define HAVE_INTTYPES_H 1
| #define HAVE_STDINT_H 1
| #define HAVE_UNISTD_H 1
| #define HAVE_DLFCN_H 1
| #define HAVE_NETDB_H 1
| #define HAVE_UTIME_H 1
| #define HAVE_SEMAPHORE_H 1
| #define HAVE_SYS_UN_H 1
| #define HAVE_LINUX_RTC_H 1
| #define HAVE_SYS_SYSCALL_H 1
| #define HAVE_ELF_H 1
| #define HAVE_POLL_H 1
| #define HAVE_SYS_POLL_H 1
| #define HAVE_SYS_WAIT_H 1
| #define HAVE_GRP_H 1
| #define HAVE_SYSLOG_H 1
| #define HAVE_WCHAR_H 1
| #define HAVE_ISINF 1
| #define SIZEOF_VOID_P 4
| #define MONO_XEN_OPT 1
| #define DISABLED_FEATURES "none"
| #define HAVE_BOEHM_GC 1
| #define HAVE_GC_H 1
| #define USE_INCLUDED_LIBGC 1
| #define HAVE_GC_GCJ_MALLOC 1
| #define HAVE_GC_ENABLE 1
| #define USED_GC_NAME "Included Boehm (with typed GC)"
| #define HAVE_DL_LOADER 1
| #define HAVE_EXECINFO_H 1
| #define HAVE_GETGRGID_R 1
| #define HAVE_GETGRNAM_R 1
| #define HAVE_GETPWNAM_R 1
| #define HAVE_GETPWUID_R 1
| #define HAVE_GETRESUID 1
| #define HAVE_SETRESUID 1
| #define HAVE_BACKTRACE_SYMBOLS 1
| #define HAVE_MKSTEMP 1
| #define HAVE_MMAP 1
| #define HAVE_MADVISE 1
| #define HAVE_LARGE_FILE_SUPPORT 1
| #define HAVE_MSG_NOSIGNAL 1
| #define HAVE_SOL_IP 1
| #define HAVE_SOL_IPV6 1
| #define HAVE_IP_PKTINFO 1
| #define HAVE_IPV6_PKTINFO 1
| #define HAVE_STRUCT_IP_MREQN 1
| #define HAVE_GETHOSTBYNAME2_R 1
| #define HAVE_INET_PTON 1
| #define HAVE_INET_ATON 1
| #define MONO_SIZEOF_SUNPATH 108
| #define MONO_ZERO_ARRAY_LENGTH 0
| #define HAVE_PTHREAD_H 1
| #define HAVE_PTHREAD_MUTEX_TIMEDLOCK 1
| #define HAVE_PTHREAD_GETATTR_NP 1
| #define HAVE_PTHREAD_ATTR_SETSTACKSIZE 1
| #define HAVE_PTHREAD_ATTR_GETSTACK 1
| #define HAVE_TM_GMTOFF 1
| #define HAVE_FINITE 1
| #define HAVE_ISFINITE 1
| #define HAVE_POLL 1
| #define HAVE_SIGNBIT 1
| #define HAVE_SYS_EPOLL_H 1
| #define HAVE_EPOLL_CTL 1
| #define HAVE_EPOLL 1
| #define HAVE_SYS_IOCTL_H 1
| #define HAVE_NET_IF_H 1
| #define HAVE_SIOCGIFCONF 1
| #define HAVE_FSTAB_H 1
| /* end confdefs.h.  */
| #include <sys/extattr.h>
configure:32497: result: no
configure:32525: checking for sys/extattr.h
configure:32533: result: no
configure:32561: checking sys/sendfile.h usability
configure:32578: i686-pc-linux-gnu-gcc -c -g -O2 -fno-strict-aliasing -Wdeclaration-after-statement -g -Wall -Wunused -Wmissing-prototypes -Wmissing-declarations -Wstrict-prototypes  -Wmissing-prototypes -Wnested-externs -Wpointer-arith -Wno-cast-qual -Wcast-align -Wwrite-strings -mno-tls-direct-seg-refs  -DGC_LINUX_THREADS -D_GNU_SOURCE -D_REENTRANT -DUSE_MMAP -DUSE_MUNMAP -D_FILE_OFFSET_BITS=64 conftest.c >&5
configure:32584: $? = 0
configure:32591: test -z "$ac_c_werror_flag" || test ! -s conftest.err
configure:32594: $? = 0
configure:32601: test -s conftest.o
configure:32604: $? = 0
configure:32615: result: yes
configure:32619: checking sys/sendfile.h presence
configure:32634: i686-pc-linux-gnu-gcc -E  -DGC_LINUX_THREADS -D_GNU_SOURCE -D_REENTRANT -DUSE_MMAP -DUSE_MUNMAP -D_FILE_OFFSET_BITS=64 conftest.c
configure:32640: $? = 0
configure:32661: result: yes
configure:32689: checking for sys/sendfile.h
configure:32697: result: yes
configure:32725: checking sys/statvfs.h usability
configure:32742: i686-pc-linux-gnu-gcc -c -g -O2 -fno-strict-aliasing -Wdeclaration-after-statement -g -Wall -Wunused -Wmissing-prototypes -Wmissing-declarations -Wstrict-prototypes  -Wmissing-prototypes -Wnested-externs -Wpointer-arith -Wno-cast-qual -Wcast-align -Wwrite-strings -mno-tls-direct-seg-refs  -DGC_LINUX_THREADS -D_GNU_SOURCE -D_REENTRANT -DUSE_MMAP -DUSE_MUNMAP -D_FILE_OFFSET_BITS=64 conftest.c >&5
configure:32748: $? = 0
configure:32755: test -z "$ac_c_werror_flag" || test ! -s conftest.err
configure:32758: $? = 0
configure:32765: test -s conftest.o
configure:32768: $? = 0
configure:32779: result: yes
configure:32783: checking sys/statvfs.h presence
configure:32798: i686-pc-linux-gnu-gcc -E  -DGC_LINUX_THREADS -D_GNU_SOURCE -D_REENTRANT -DUSE_MMAP -DUSE_MUNMAP -D_FILE_OFFSET_BITS=64 conftest.c
configure:32804: $? = 0
configure:32825: result: yes
configure:32853: checking for sys/statvfs.h
configure:32861: result: yes
configure:32889: checking sys/vfstab.h usability
configure:32906: i686-pc-linux-gnu-gcc -c -g -O2 -fno-strict-aliasing -Wdeclaration-after-statement -g -Wall -Wunused -Wmissing-prototypes -Wmissing-declarations -Wstrict-prototypes  -Wmissing-prototypes -Wnested-externs -Wpointer-arith -Wno-cast-qual -Wcast-align -Wwrite-strings -mno-tls-direct-seg-refs  -DGC_LINUX_THREADS -D_GNU_SOURCE -D_REENTRANT -DUSE_MMAP -DUSE_MUNMAP -D_FILE_OFFSET_BITS=64 conftest.c >&5
conftest.c:120:24: sys/vfstab.h: No such file or directory
configure:32912: $? = 1
configure: failed program was:
| /* confdefs.h.  */
| #define PACKAGE_NAME ""
| #define PACKAGE_TARNAME ""
| #define PACKAGE_VERSION ""
| #define PACKAGE_STRING ""
| #define PACKAGE_BUGREPORT ""
| #define PACKAGE "mono"
| #define VERSION "1.2"
| #define STDC_HEADERS 1
| #define HAVE_SYS_TYPES_H 1
| #define HAVE_SYS_STAT_H 1
| #define HAVE_STDLIB_H 1
| #define HAVE_STRING_H 1
| #define HAVE_MEMORY_H 1
| #define HAVE_STRINGS_H 1
| #define HAVE_INTTYPES_H 1
| #define HAVE_STDINT_H 1
| #define HAVE_UNISTD_H 1
| #define HAVE_DLFCN_H 1
| #define HAVE_NETDB_H 1
| #define HAVE_UTIME_H 1
| #define HAVE_SEMAPHORE_H 1
| #define HAVE_SYS_UN_H 1
| #define HAVE_LINUX_RTC_H 1
| #define HAVE_SYS_SYSCALL_H 1
| #define HAVE_ELF_H 1
| #define HAVE_POLL_H 1
| #define HAVE_SYS_POLL_H 1
| #define HAVE_SYS_WAIT_H 1
| #define HAVE_GRP_H 1
| #define HAVE_SYSLOG_H 1
| #define HAVE_WCHAR_H 1
| #define HAVE_ISINF 1
| #define SIZEOF_VOID_P 4
| #define MONO_XEN_OPT 1
| #define DISABLED_FEATURES "none"
| #define HAVE_BOEHM_GC 1
| #define HAVE_GC_H 1
| #define USE_INCLUDED_LIBGC 1
| #define HAVE_GC_GCJ_MALLOC 1
| #define HAVE_GC_ENABLE 1
| #define USED_GC_NAME "Included Boehm (with typed GC)"
| #define HAVE_DL_LOADER 1
| #define HAVE_EXECINFO_H 1
| #define HAVE_GETGRGID_R 1
| #define HAVE_GETGRNAM_R 1
| #define HAVE_GETPWNAM_R 1
| #define HAVE_GETPWUID_R 1
| #define HAVE_GETRESUID 1
| #define HAVE_SETRESUID 1
| #define HAVE_BACKTRACE_SYMBOLS 1
| #define HAVE_MKSTEMP 1
| #define HAVE_MMAP 1
| #define HAVE_MADVISE 1
| #define HAVE_LARGE_FILE_SUPPORT 1
| #define HAVE_MSG_NOSIGNAL 1
| #define HAVE_SOL_IP 1
| #define HAVE_SOL_IPV6 1
| #define HAVE_IP_PKTINFO 1
| #define HAVE_IPV6_PKTINFO 1
| #define HAVE_STRUCT_IP_MREQN 1
| #define HAVE_GETHOSTBYNAME2_R 1
| #define HAVE_INET_PTON 1
| #define HAVE_INET_ATON 1
| #define MONO_SIZEOF_SUNPATH 108
| #define MONO_ZERO_ARRAY_LENGTH 0
| #define HAVE_PTHREAD_H 1
| #define HAVE_PTHREAD_MUTEX_TIMEDLOCK 1
| #define HAVE_PTHREAD_GETATTR_NP 1
| #define HAVE_PTHREAD_ATTR_SETSTACKSIZE 1
| #define HAVE_PTHREAD_ATTR_GETSTACK 1
| #define HAVE_TM_GMTOFF 1
| #define HAVE_FINITE 1
| #define HAVE_ISFINITE 1
| #define HAVE_POLL 1
| #define HAVE_SIGNBIT 1
| #define HAVE_SYS_EPOLL_H 1
| #define HAVE_EPOLL_CTL 1
| #define HAVE_EPOLL 1
| #define HAVE_SYS_IOCTL_H 1
| #define HAVE_NET_IF_H 1
| #define HAVE_SIOCGIFCONF 1
| #define HAVE_FSTAB_H 1
| #define HAVE_SYS_SENDFILE_H 1
| #define HAVE_SYS_STATVFS_H 1
| /* end confdefs.h.  */
| #include <stdio.h>
| #if HAVE_SYS_TYPES_H
| # include <sys/types.h>
| #endif
| #if HAVE_SYS_STAT_H
| # include <sys/stat.h>
| #endif
| #if STDC_HEADERS
| # include <stdlib.h>
| # include <stddef.h>
| #else
| # if HAVE_STDLIB_H
| #  include <stdlib.h>
| # endif
| #endif
| #if HAVE_STRING_H
| # if !STDC_HEADERS && HAVE_MEMORY_H
| #  include <memory.h>
| # endif
| # include <string.h>
| #endif
| #if HAVE_STRINGS_H
| # include <strings.h>
| #endif
| #if HAVE_INTTYPES_H
| # include <inttypes.h>
| #endif
| #if HAVE_STDINT_H
| # include <stdint.h>
| #endif
| #if HAVE_UNISTD_H
| # include <unistd.h>
| #endif
| #include <sys/vfstab.h>
configure:32943: result: no
configure:32947: checking sys/vfstab.h presence
configure:32962: i686-pc-linux-gnu-gcc -E  -DGC_LINUX_THREADS -D_GNU_SOURCE -D_REENTRANT -DUSE_MMAP -DUSE_MUNMAP -D_FILE_OFFSET_BITS=64 conftest.c
conftest.c:87:24: sys/vfstab.h: No such file or directory
configure:32968: $? = 1
configure: failed program was:
| /* confdefs.h.  */
| #define PACKAGE_NAME ""
| #define PACKAGE_TARNAME ""
| #define PACKAGE_VERSION ""
| #define PACKAGE_STRING ""
| #define PACKAGE_BUGREPORT ""
| #define PACKAGE "mono"
| #define VERSION "1.2"
| #define STDC_HEADERS 1
| #define HAVE_SYS_TYPES_H 1
| #define HAVE_SYS_STAT_H 1
| #define HAVE_STDLIB_H 1
| #define HAVE_STRING_H 1
| #define HAVE_MEMORY_H 1
| #define HAVE_STRINGS_H 1
| #define HAVE_INTTYPES_H 1
| #define HAVE_STDINT_H 1
| #define HAVE_UNISTD_H 1
| #define HAVE_DLFCN_H 1
| #define HAVE_NETDB_H 1
| #define HAVE_UTIME_H 1
| #define HAVE_SEMAPHORE_H 1
| #define HAVE_SYS_UN_H 1
| #define HAVE_LINUX_RTC_H 1
| #define HAVE_SYS_SYSCALL_H 1
| #define HAVE_ELF_H 1
| #define HAVE_POLL_H 1
| #define HAVE_SYS_POLL_H 1
| #define HAVE_SYS_WAIT_H 1
| #define HAVE_GRP_H 1
| #define HAVE_SYSLOG_H 1
| #define HAVE_WCHAR_H 1
| #define HAVE_ISINF 1
| #define SIZEOF_VOID_P 4
| #define MONO_XEN_OPT 1
| #define DISABLED_FEATURES "none"
| #define HAVE_BOEHM_GC 1
| #define HAVE_GC_H 1
| #define USE_INCLUDED_LIBGC 1
| #define HAVE_GC_GCJ_MALLOC 1
| #define HAVE_GC_ENABLE 1
| #define USED_GC_NAME "Included Boehm (with typed GC)"
| #define HAVE_DL_LOADER 1
| #define HAVE_EXECINFO_H 1
| #define HAVE_GETGRGID_R 1
| #define HAVE_GETGRNAM_R 1
| #define HAVE_GETPWNAM_R 1
| #define HAVE_GETPWUID_R 1
| #define HAVE_GETRESUID 1
| #define HAVE_SETRESUID 1
| #define HAVE_BACKTRACE_SYMBOLS 1
| #define HAVE_MKSTEMP 1
| #define HAVE_MMAP 1
| #define HAVE_MADVISE 1
| #define HAVE_LARGE_FILE_SUPPORT 1
| #define HAVE_MSG_NOSIGNAL 1
| #define HAVE_SOL_IP 1
| #define HAVE_SOL_IPV6 1
| #define HAVE_IP_PKTINFO 1
| #define HAVE_IPV6_PKTINFO 1
| #define HAVE_STRUCT_IP_MREQN 1
| #define HAVE_GETHOSTBYNAME2_R 1
| #define HAVE_INET_PTON 1
| #define HAVE_INET_ATON 1
| #define MONO_SIZEOF_SUNPATH 108
| #define MONO_ZERO_ARRAY_LENGTH 0
| #define HAVE_PTHREAD_H 1
| #define HAVE_PTHREAD_MUTEX_TIMEDLOCK 1
| #define HAVE_PTHREAD_GETATTR_NP 1
| #define HAVE_PTHREAD_ATTR_SETSTACKSIZE 1
| #define HAVE_PTHREAD_ATTR_GETSTACK 1
| #define HAVE_TM_GMTOFF 1
| #define HAVE_FINITE 1
| #define HAVE_ISFINITE 1
| #define HAVE_POLL 1
| #define HAVE_SIGNBIT 1
| #define HAVE_SYS_EPOLL_H 1
| #define HAVE_EPOLL_CTL 1
| #define HAVE_EPOLL 1
| #define HAVE_SYS_IOCTL_H 1
| #define HAVE_NET_IF_H 1
| #define HAVE_SIOCGIFCONF 1
| #define HAVE_FSTAB_H 1
| #define HAVE_SYS_SENDFILE_H 1
| #define HAVE_SYS_STATVFS_H 1
| /* end confdefs.h.  */
| #include <sys/vfstab.h>
configure:32989: result: no
configure:33017: checking for sys/vfstab.h
configure:33025: result: no
configure:33053: checking sys/xattr.h usability
configure:33070: i686-pc-linux-gnu-gcc -c -g -O2 -fno-strict-aliasing -Wdeclaration-after-statement -g -Wall -Wunused -Wmissing-prototypes -Wmissing-declarations -Wstrict-prototypes  -Wmissing-prototypes -Wnested-externs -Wpointer-arith -Wno-cast-qual -Wcast-align -Wwrite-strings -mno-tls-direct-seg-refs  -DGC_LINUX_THREADS -D_GNU_SOURCE -D_REENTRANT -DUSE_MMAP -DUSE_MUNMAP -D_FILE_OFFSET_BITS=64 conftest.c >&5
configure:33076: $? = 0
configure:33083: test -z "$ac_c_werror_flag" || test ! -s conftest.err
configure:33086: $? = 0
configure:33093: test -s conftest.o
configure:33096: $? = 0
configure:33107: result: yes
configure:33111: checking sys/xattr.h presence
configure:33126: i686-pc-linux-gnu-gcc -E  -DGC_LINUX_THREADS -D_GNU_SOURCE -D_REENTRANT -DUSE_MMAP -DUSE_MUNMAP -D_FILE_OFFSET_BITS=64 conftest.c
configure:33132: $? = 0
configure:33153: result: yes
configure:33181: checking for sys/xattr.h
configure:33189: result: yes
configure:33217: checking sys/mman.h usability
configure:33234: i686-pc-linux-gnu-gcc -c -g -O2 -fno-strict-aliasing -Wdeclaration-after-statement -g -Wall -Wunused -Wmissing-prototypes -Wmissing-declarations -Wstrict-prototypes  -Wmissing-prototypes -Wnested-externs -Wpointer-arith -Wno-cast-qual -Wcast-align -Wwrite-strings -mno-tls-direct-seg-refs  -DGC_LINUX_THREADS -D_GNU_SOURCE -D_REENTRANT -DUSE_MMAP -DUSE_MUNMAP -D_FILE_OFFSET_BITS=64 conftest.c >&5
configure:33240: $? = 0
configure:33247: test -z "$ac_c_werror_flag" || test ! -s conftest.err
configure:33250: $? = 0
configure:33257: test -s conftest.o
configure:33260: $? = 0
configure:33271: result: yes
configure:33275: checking sys/mman.h presence
configure:33290: i686-pc-linux-gnu-gcc -E  -DGC_LINUX_THREADS -D_GNU_SOURCE -D_REENTRANT -DUSE_MMAP -DUSE_MUNMAP -D_FILE_OFFSET_BITS=64 conftest.c
configure:33296: $? = 0
configure:33317: result: yes
configure:33345: checking for sys/mman.h
configure:33353: result: yes
configure:33370: checking for getdomainname
configure:33426: i686-pc-linux-gnu-gcc -o conftest -g -O2 -fno-strict-aliasing -Wdeclaration-after-statement -g -Wall -Wunused -Wmissing-prototypes -Wmissing-declarations -Wstrict-prototypes  -Wmissing-prototypes -Wnested-externs -Wpointer-arith -Wno-cast-qual -Wcast-align -Wwrite-strings -mno-tls-direct-seg-refs  -DGC_LINUX_THREADS -D_GNU_SOURCE -D_REENTRANT -DUSE_MMAP -DUSE_MUNMAP -D_FILE_OFFSET_BITS=64  conftest.c  -ldl -lpthread -lm >&5
conftest.c:112: warning: function declaration isn't a prototype
conftest.c:122: warning: function declaration isn't a prototype
configure:33432: $? = 0
configure:33439: test -z "$ac_c_werror_flag" || test ! -s conftest.err
configure:33442: $? = 0
configure:33449: test -s conftest
configure:33452: $? = 0
configure:33466: result: yes
configure:33480: checking for setdomainname
configure:33536: i686-pc-linux-gnu-gcc -o conftest -g -O2 -fno-strict-aliasing -Wdeclaration-after-statement -g -Wall -Wunused -Wmissing-prototypes -Wmissing-declarations -Wstrict-prototypes  -Wmissing-prototypes -Wnested-externs -Wpointer-arith -Wno-cast-qual -Wcast-align -Wwrite-strings -mno-tls-direct-seg-refs  -DGC_LINUX_THREADS -D_GNU_SOURCE -D_REENTRANT -DUSE_MMAP -DUSE_MUNMAP -D_FILE_OFFSET_BITS=64  conftest.c  -ldl -lpthread -lm >&5
conftest.c:113: warning: function declaration isn't a prototype
conftest.c:123: warning: function declaration isn't a prototype
configure:33542: $? = 0
configure:33549: test -z "$ac_c_werror_flag" || test ! -s conftest.err
configure:33552: $? = 0
configure:33559: test -s conftest
configure:33562: $? = 0
configure:33576: result: yes
configure:33590: checking for fgetgrent
configure:33646: i686-pc-linux-gnu-gcc -o conftest -g -O2 -fno-strict-aliasing -Wdeclaration-after-statement -g -Wall -Wunused -Wmissing-prototypes -Wmissing-declarations -Wstrict-prototypes  -Wmissing-prototypes -Wnested-externs -Wpointer-arith -Wno-cast-qual -Wcast-align -Wwrite-strings -mno-tls-direct-seg-refs  -DGC_LINUX_THREADS -D_GNU_SOURCE -D_REENTRANT -DUSE_MMAP -DUSE_MUNMAP -D_FILE_OFFSET_BITS=64  conftest.c  -ldl -lpthread -lm >&5
conftest.c:114: warning: function declaration isn't a prototype
conftest.c:124: warning: function declaration isn't a prototype
configure:33652: $? = 0
configure:33659: test -z "$ac_c_werror_flag" || test ! -s conftest.err
configure:33662: $? = 0
configure:33669: test -s conftest
configure:33672: $? = 0
configure:33686: result: yes
configure:33700: checking for fgetpwent
configure:33756: i686-pc-linux-gnu-gcc -o conftest -g -O2 -fno-strict-aliasing -Wdeclaration-after-statement -g -Wall -Wunused -Wmissing-prototypes -Wmissing-declarations -Wstrict-prototypes  -Wmissing-prototypes -Wnested-externs -Wpointer-arith -Wno-cast-qual -Wcast-align -Wwrite-strings -mno-tls-direct-seg-refs  -DGC_LINUX_THREADS -D_GNU_SOURCE -D_REENTRANT -DUSE_MMAP -DUSE_MUNMAP -D_FILE_OFFSET_BITS=64  conftest.c  -ldl -lpthread -lm >&5
conftest.c:115: warning: function declaration isn't a prototype
conftest.c:125: warning: function declaration isn't a prototype
configure:33762: $? = 0
configure:33769: test -z "$ac_c_werror_flag" || test ! -s conftest.err
configure:33772: $? = 0
configure:33779: test -s conftest
configure:33782: $? = 0
configure:33796: result: yes
configure:33810: checking for fgetpwent
configure:33906: result: yes
configure:33920: checking for getfsstat
configure:33976: i686-pc-linux-gnu-gcc -o conftest -g -O2 -fno-strict-aliasing -Wdeclaration-after-statement -g -Wall -Wunused -Wmissing-prototypes -Wmissing-declarations -Wstrict-prototypes  -Wmissing-prototypes -Wnested-externs -Wpointer-arith -Wno-cast-qual -Wcast-align -Wwrite-strings -mno-tls-direct-seg-refs  -DGC_LINUX_THREADS -D_GNU_SOURCE -D_REENTRANT -DUSE_MMAP -DUSE_MUNMAP -D_FILE_OFFSET_BITS=64  conftest.c  -ldl -lpthread -lm >&5
conftest.c:117: warning: function declaration isn't a prototype
conftest.c:127: warning: function declaration isn't a prototype
/tmp/ccOUS2xh.o: In function `main':
/usr/local/src/mono/conftest.c:128: undefined reference to `getfsstat'
collect2: ld returned 1 exit status
configure:33982: $? = 1
configure: failed program was:
| /* confdefs.h.  */
| #define PACKAGE_NAME ""
| #define PACKAGE_TARNAME ""
| #define PACKAGE_VERSION ""
| #define PACKAGE_STRING ""
| #define PACKAGE_BUGREPORT ""
| #define PACKAGE "mono"
| #define VERSION "1.2"
| #define STDC_HEADERS 1
| #define HAVE_SYS_TYPES_H 1
| #define HAVE_SYS_STAT_H 1
| #define HAVE_STDLIB_H 1
| #define HAVE_STRING_H 1
| #define HAVE_MEMORY_H 1
| #define HAVE_STRINGS_H 1
| #define HAVE_INTTYPES_H 1
| #define HAVE_STDINT_H 1
| #define HAVE_UNISTD_H 1
| #define HAVE_DLFCN_H 1
| #define HAVE_NETDB_H 1
| #define HAVE_UTIME_H 1
| #define HAVE_SEMAPHORE_H 1
| #define HAVE_SYS_UN_H 1
| #define HAVE_LINUX_RTC_H 1
| #define HAVE_SYS_SYSCALL_H 1
| #define HAVE_ELF_H 1
| #define HAVE_POLL_H 1
| #define HAVE_SYS_POLL_H 1
| #define HAVE_SYS_WAIT_H 1
| #define HAVE_GRP_H 1
| #define HAVE_SYSLOG_H 1
| #define HAVE_WCHAR_H 1
| #define HAVE_ISINF 1
| #define SIZEOF_VOID_P 4
| #define MONO_XEN_OPT 1
| #define DISABLED_FEATURES "none"
| #define HAVE_BOEHM_GC 1
| #define HAVE_GC_H 1
| #define USE_INCLUDED_LIBGC 1
| #define HAVE_GC_GCJ_MALLOC 1
| #define HAVE_GC_ENABLE 1
| #define USED_GC_NAME "Included Boehm (with typed GC)"
| #define HAVE_DL_LOADER 1
| #define HAVE_EXECINFO_H 1
| #define HAVE_GETGRGID_R 1
| #define HAVE_GETGRNAM_R 1
| #define HAVE_GETPWNAM_R 1
| #define HAVE_GETPWUID_R 1
| #define HAVE_GETRESUID 1
| #define HAVE_SETRESUID 1
| #define HAVE_BACKTRACE_SYMBOLS 1
| #define HAVE_MKSTEMP 1
| #define HAVE_MMAP 1
| #define HAVE_MADVISE 1
| #define HAVE_LARGE_FILE_SUPPORT 1
| #define HAVE_MSG_NOSIGNAL 1
| #define HAVE_SOL_IP 1
| #define HAVE_SOL_IPV6 1
| #define HAVE_IP_PKTINFO 1
| #define HAVE_IPV6_PKTINFO 1
| #define HAVE_STRUCT_IP_MREQN 1
| #define HAVE_GETHOSTBYNAME2_R 1
| #define HAVE_INET_PTON 1
| #define HAVE_INET_ATON 1
| #define MONO_SIZEOF_SUNPATH 108
| #define MONO_ZERO_ARRAY_LENGTH 0
| #define HAVE_PTHREAD_H 1
| #define HAVE_PTHREAD_MUTEX_TIMEDLOCK 1
| #define HAVE_PTHREAD_GETATTR_NP 1
| #define HAVE_PTHREAD_ATTR_SETSTACKSIZE 1
| #define HAVE_PTHREAD_ATTR_GETSTACK 1
| #define HAVE_TM_GMTOFF 1
| #define HAVE_FINITE 1
| #define HAVE_ISFINITE 1
| #define HAVE_POLL 1
| #define HAVE_SIGNBIT 1
| #define HAVE_SYS_EPOLL_H 1
| #define HAVE_EPOLL_CTL 1
| #define HAVE_EPOLL 1
| #define HAVE_SYS_IOCTL_H 1
| #define HAVE_NET_IF_H 1
| #define HAVE_SIOCGIFCONF 1
| #define HAVE_FSTAB_H 1
| #define HAVE_SYS_SENDFILE_H 1
| #define HAVE_SYS_STATVFS_H 1
| #define HAVE_SYS_XATTR_H 1
| #define HAVE_SYS_MMAN_H 1
| #define HAVE_GETDOMAINNAME 1
| #define HAVE_SETDOMAINNAME 1
| #define HAVE_FGETGRENT 1
| #define HAVE_FGETPWENT 1
| #define HAVE_FGETPWENT 1
| /* end confdefs.h.  */
| /* Define getfsstat to an innocuous variant, in case <limits.h> declares getfsstat.
|    For example, HP-UX 11i <limits.h> declares gettimeofday.  */
| #define getfsstat innocuous_getfsstat
| 
| /* System header to define __stub macros and hopefully few prototypes,
|     which can conflict with char getfsstat (); below.
|     Prefer <limits.h> to <assert.h> if __STDC__ is defined, since
|     <limits.h> exists even on freestanding compilers.  */
| 
| #ifdef __STDC__
| # include <limits.h>
| #else
| # include <assert.h>
| #endif
| 
| #undef getfsstat
| 
| /* Override any GCC internal prototype to avoid an error.
|    Use char because int might match the return type of a GCC
|    builtin and then its argument prototype would still apply.  */
| #ifdef __cplusplus
| extern "C"
| #endif
| char getfsstat ();
| /* The GNU C library defines this for functions which it implements
|     to always fail with ENOSYS.  Some functions are actually named
|     something starting with __ and the normal name is an alias.  */
| #if defined __stub_getfsstat || defined __stub___getfsstat
| choke me
| #endif
| 
| int
| main ()
| {
| return getfsstat ();
|   ;
|   return 0;
| }
configure:34016: result: no
configure:34030: checking for lutimes
configure:34086: i686-pc-linux-gnu-gcc -o conftest -g -O2 -fno-strict-aliasing -Wdeclaration-after-statement -g -Wall -Wunused -Wmissing-prototypes -Wmissing-declarations -Wstrict-prototypes  -Wmissing-prototypes -Wnested-externs -Wpointer-arith -Wno-cast-qual -Wcast-align -Wwrite-strings -mno-tls-direct-seg-refs  -DGC_LINUX_THREADS -D_GNU_SOURCE -D_REENTRANT -DUSE_MMAP -DUSE_MUNMAP -D_FILE_OFFSET_BITS=64  conftest.c  -ldl -lpthread -lm >&5
conftest.c:117: warning: function declaration isn't a prototype
conftest.c:122: error: syntax error before "me"
conftest.c:125: error: syntax error before "int"
conftest.c:127: warning: function declaration isn't a prototype
configure:34092: $? = 1
configure: failed program was:
| /* confdefs.h.  */
| #define PACKAGE_NAME ""
| #define PACKAGE_TARNAME ""
| #define PACKAGE_VERSION ""
| #define PACKAGE_STRING ""
| #define PACKAGE_BUGREPORT ""
| #define PACKAGE "mono"
| #define VERSION "1.2"
| #define STDC_HEADERS 1
| #define HAVE_SYS_TYPES_H 1
| #define HAVE_SYS_STAT_H 1
| #define HAVE_STDLIB_H 1
| #define HAVE_STRING_H 1
| #define HAVE_MEMORY_H 1
| #define HAVE_STRINGS_H 1
| #define HAVE_INTTYPES_H 1
| #define HAVE_STDINT_H 1
| #define HAVE_UNISTD_H 1
| #define HAVE_DLFCN_H 1
| #define HAVE_NETDB_H 1
| #define HAVE_UTIME_H 1
| #define HAVE_SEMAPHORE_H 1
| #define HAVE_SYS_UN_H 1
| #define HAVE_LINUX_RTC_H 1
| #define HAVE_SYS_SYSCALL_H 1
| #define HAVE_ELF_H 1
| #define HAVE_POLL_H 1
| #define HAVE_SYS_POLL_H 1
| #define HAVE_SYS_WAIT_H 1
| #define HAVE_GRP_H 1
| #define HAVE_SYSLOG_H 1
| #define HAVE_WCHAR_H 1
| #define HAVE_ISINF 1
| #define SIZEOF_VOID_P 4
| #define MONO_XEN_OPT 1
| #define DISABLED_FEATURES "none"
| #define HAVE_BOEHM_GC 1
| #define HAVE_GC_H 1
| #define USE_INCLUDED_LIBGC 1
| #define HAVE_GC_GCJ_MALLOC 1
| #define HAVE_GC_ENABLE 1
| #define USED_GC_NAME "Included Boehm (with typed GC)"
| #define HAVE_DL_LOADER 1
| #define HAVE_EXECINFO_H 1
| #define HAVE_GETGRGID_R 1
| #define HAVE_GETGRNAM_R 1
| #define HAVE_GETPWNAM_R 1
| #define HAVE_GETPWUID_R 1
| #define HAVE_GETRESUID 1
| #define HAVE_SETRESUID 1
| #define HAVE_BACKTRACE_SYMBOLS 1
| #define HAVE_MKSTEMP 1
| #define HAVE_MMAP 1
| #define HAVE_MADVISE 1
| #define HAVE_LARGE_FILE_SUPPORT 1
| #define HAVE_MSG_NOSIGNAL 1
| #define HAVE_SOL_IP 1
| #define HAVE_SOL_IPV6 1
| #define HAVE_IP_PKTINFO 1
| #define HAVE_IPV6_PKTINFO 1
| #define HAVE_STRUCT_IP_MREQN 1
| #define HAVE_GETHOSTBYNAME2_R 1
| #define HAVE_INET_PTON 1
| #define HAVE_INET_ATON 1
| #define MONO_SIZEOF_SUNPATH 108
| #define MONO_ZERO_ARRAY_LENGTH 0
| #define HAVE_PTHREAD_H 1
| #define HAVE_PTHREAD_MUTEX_TIMEDLOCK 1
| #define HAVE_PTHREAD_GETATTR_NP 1
| #define HAVE_PTHREAD_ATTR_SETSTACKSIZE 1
| #define HAVE_PTHREAD_ATTR_GETSTACK 1
| #define HAVE_TM_GMTOFF 1
| #define HAVE_FINITE 1
| #define HAVE_ISFINITE 1
| #define HAVE_POLL 1
| #define HAVE_SIGNBIT 1
| #define HAVE_SYS_EPOLL_H 1
| #define HAVE_EPOLL_CTL 1
| #define HAVE_EPOLL 1
| #define HAVE_SYS_IOCTL_H 1
| #define HAVE_NET_IF_H 1
| #define HAVE_SIOCGIFCONF 1
| #define HAVE_FSTAB_H 1
| #define HAVE_SYS_SENDFILE_H 1
| #define HAVE_SYS_STATVFS_H 1
| #define HAVE_SYS_XATTR_H 1
| #define HAVE_SYS_MMAN_H 1
| #define HAVE_GETDOMAINNAME 1
| #define HAVE_SETDOMAINNAME 1
| #define HAVE_FGETGRENT 1
| #define HAVE_FGETPWENT 1
| #define HAVE_FGETPWENT 1
| /* end confdefs.h.  */
| /* Define lutimes to an innocuous variant, in case <limits.h> declares lutimes.
|    For example, HP-UX 11i <limits.h> declares gettimeofday.  */
| #define lutimes innocuous_lutimes
| 
| /* System header to define __stub macros and hopefully few prototypes,
|     which can conflict with char lutimes (); below.
|     Prefer <limits.h> to <assert.h> if __STDC__ is defined, since
|     <limits.h> exists even on freestanding compilers.  */
| 
| #ifdef __STDC__
| # include <limits.h>
| #else
| # include <assert.h>
| #endif
| 
| #undef lutimes
| 
| /* Override any GCC internal prototype to avoid an error.
|    Use char because int might match the return type of a GCC
|    builtin and then its argument prototype would still apply.  */
| #ifdef __cplusplus
| extern "C"
| #endif
| char lutimes ();
| /* The GNU C library defines this for functions which it implements
|     to always fail with ENOSYS.  Some functions are actually named
|     something starting with __ and the normal name is an alias.  */
| #if defined __stub_lutimes || defined __stub___lutimes
| choke me
| #endif
| 
| int
| main ()
| {
| return lutimes ();
|   ;
|   return 0;
| }
configure:34126: result: no
configure:34140: checking for mremap
configure:34196: i686-pc-linux-gnu-gcc -o conftest -g -O2 -fno-strict-aliasing -Wdeclaration-after-statement -g -Wall -Wunused -Wmissing-prototypes -Wmissing-declarations -Wstrict-prototypes  -Wmissing-prototypes -Wnested-externs -Wpointer-arith -Wno-cast-qual -Wcast-align -Wwrite-strings -mno-tls-direct-seg-refs  -DGC_LINUX_THREADS -D_GNU_SOURCE -D_REENTRANT -DUSE_MMAP -DUSE_MUNMAP -D_FILE_OFFSET_BITS=64  conftest.c  -ldl -lpthread -lm >&5
conftest.c:117: warning: function declaration isn't a prototype
conftest.c:127: warning: function declaration isn't a prototype
configure:34202: $? = 0
configure:34209: test -z "$ac_c_werror_flag" || test ! -s conftest.err
configure:34212: $? = 0
configure:34219: test -s conftest
configure:34222: $? = 0
configure:34236: result: yes
configure:34250: checking for remap_file_pages
configure:34306: i686-pc-linux-gnu-gcc -o conftest -g -O2 -fno-strict-aliasing -Wdeclaration-after-statement -g -Wall -Wunused -Wmissing-prototypes -Wmissing-declarations -Wstrict-prototypes  -Wmissing-prototypes -Wnested-externs -Wpointer-arith -Wno-cast-qual -Wcast-align -Wwrite-strings -mno-tls-direct-seg-refs  -DGC_LINUX_THREADS -D_GNU_SOURCE -D_REENTRANT -DUSE_MMAP -DUSE_MUNMAP -D_FILE_OFFSET_BITS=64  conftest.c  -ldl -lpthread -lm >&5
conftest.c:118: warning: function declaration isn't a prototype
conftest.c:128: warning: function declaration isn't a prototype
configure:34312: $? = 0
configure:34319: test -z "$ac_c_werror_flag" || test ! -s conftest.err
configure:34322: $? = 0
configure:34329: test -s conftest
configure:34332: $? = 0
configure:34346: result: yes
configure:34360: checking for posix_fadvise
configure:34416: i686-pc-linux-gnu-gcc -o conftest -g -O2 -fno-strict-aliasing -Wdeclaration-after-statement -g -Wall -Wunused -Wmissing-prototypes -Wmissing-declarations -Wstrict-prototypes  -Wmissing-prototypes -Wnested-externs -Wpointer-arith -Wno-cast-qual -Wcast-align -Wwrite-strings -mno-tls-direct-seg-refs  -DGC_LINUX_THREADS -D_GNU_SOURCE -D_REENTRANT -DUSE_MMAP -DUSE_MUNMAP -D_FILE_OFFSET_BITS=64  conftest.c  -ldl -lpthread -lm >&5
conftest.c:119: warning: function declaration isn't a prototype
conftest.c:129: warning: function declaration isn't a prototype
configure:34422: $? = 0
configure:34429: test -z "$ac_c_werror_flag" || test ! -s conftest.err
configure:34432: $? = 0
configure:34439: test -s conftest
configure:34442: $? = 0
configure:34456: result: yes
configure:34470: checking for posix_fallocate
configure:34526: i686-pc-linux-gnu-gcc -o conftest -g -O2 -fno-strict-aliasing -Wdeclaration-after-statement -g -Wall -Wunused -Wmissing-prototypes -Wmissing-declarations -Wstrict-prototypes  -Wmissing-prototypes -Wnested-externs -Wpointer-arith -Wno-cast-qual -Wcast-align -Wwrite-strings -mno-tls-direct-seg-refs  -DGC_LINUX_THREADS -D_GNU_SOURCE -D_REENTRANT -DUSE_MMAP -DUSE_MUNMAP -D_FILE_OFFSET_BITS=64  conftest.c  -ldl -lpthread -lm >&5
conftest.c:120: warning: function declaration isn't a prototype
conftest.c:130: warning: function declaration isn't a prototype
configure:34532: $? = 0
configure:34539: test -z "$ac_c_werror_flag" || test ! -s conftest.err
configure:34542: $? = 0
configure:34549: test -s conftest
configure:34552: $? = 0
configure:34566: result: yes
configure:34580: checking for posix_madvise
configure:34636: i686-pc-linux-gnu-gcc -o conftest -g -O2 -fno-strict-aliasing -Wdeclaration-after-statement -g -Wall -Wunused -Wmissing-prototypes -Wmissing-declarations -Wstrict-prototypes  -Wmissing-prototypes -Wnested-externs -Wpointer-arith -Wno-cast-qual -Wcast-align -Wwrite-strings -mno-tls-direct-seg-refs  -DGC_LINUX_THREADS -D_GNU_SOURCE -D_REENTRANT -DUSE_MMAP -DUSE_MUNMAP -D_FILE_OFFSET_BITS=64  conftest.c  -ldl -lpthread -lm >&5
conftest.c:121: warning: function declaration isn't a prototype
conftest.c:131: warning: function declaration isn't a prototype
configure:34642: $? = 0
configure:34649: test -z "$ac_c_werror_flag" || test ! -s conftest.err
configure:34652: $? = 0
configure:34659: test -s conftest
configure:34662: $? = 0
configure:34676: result: yes
configure:34690: checking for vsnprintf
configure:34746: i686-pc-linux-gnu-gcc -o conftest -g -O2 -fno-strict-aliasing -Wdeclaration-after-statement -g -Wall -Wunused -Wmissing-prototypes -Wmissing-declarations -Wstrict-prototypes  -Wmissing-prototypes -Wnested-externs -Wpointer-arith -Wno-cast-qual -Wcast-align -Wwrite-strings -mno-tls-direct-seg-refs  -DGC_LINUX_THREADS -D_GNU_SOURCE -D_REENTRANT -DUSE_MMAP -DUSE_MUNMAP -D_FILE_OFFSET_BITS=64  conftest.c  -ldl -lpthread -lm >&5
conftest.c:122: warning: function declaration isn't a prototype
conftest.c:122: warning: conflicting types for built-in function 'vsnprintf'
conftest.c:132: warning: function declaration isn't a prototype
configure:34752: $? = 0
configure:34759: test -z "$ac_c_werror_flag" || test ! -s conftest.err
configure:34762: $? = 0
configure:34769: test -s conftest
configure:34772: $? = 0
configure:34786: result: yes
configure:34800: checking for sendfile
configure:34856: i686-pc-linux-gnu-gcc -o conftest -g -O2 -fno-strict-aliasing -Wdeclaration-after-statement -g -Wall -Wunused -Wmissing-prototypes -Wmissing-declarations -Wstrict-prototypes  -Wmissing-prototypes -Wnested-externs -Wpointer-arith -Wno-cast-qual -Wcast-align -Wwrite-strings -mno-tls-direct-seg-refs  -DGC_LINUX_THREADS -D_GNU_SOURCE -D_REENTRANT -DUSE_MMAP -DUSE_MUNMAP -D_FILE_OFFSET_BITS=64  conftest.c  -ldl -lpthread -lm >&5
conftest.c:123: warning: function declaration isn't a prototype
conftest.c:133: warning: function declaration isn't a prototype
configure:34862: $? = 0
configure:34869: test -z "$ac_c_werror_flag" || test ! -s conftest.err
configure:34872: $? = 0
configure:34879: test -s conftest
configure:34882: $? = 0
configure:34896: result: yes
configure:34910: checking for sethostid
configure:34966: i686-pc-linux-gnu-gcc -o conftest -g -O2 -fno-strict-aliasing -Wdeclaration-after-statement -g -Wall -Wunused -Wmissing-prototypes -Wmissing-declarations -Wstrict-prototypes  -Wmissing-prototypes -Wnested-externs -Wpointer-arith -Wno-cast-qual -Wcast-align -Wwrite-strings -mno-tls-direct-seg-refs  -DGC_LINUX_THREADS -D_GNU_SOURCE -D_REENTRANT -DUSE_MMAP -DUSE_MUNMAP -D_FILE_OFFSET_BITS=64  conftest.c  -ldl -lpthread -lm >&5
conftest.c:124: warning: function declaration isn't a prototype
conftest.c:134: warning: function declaration isn't a prototype
configure:34972: $? = 0
configure:34979: test -z "$ac_c_werror_flag" || test ! -s conftest.err
configure:34982: $? = 0
configure:34989: test -s conftest
configure:34992: $? = 0
configure:35006: result: yes
configure:35020: checking for statfs
configure:35076: i686-pc-linux-gnu-gcc -o conftest -g -O2 -fno-strict-aliasing -Wdeclaration-after-statement -g -Wall -Wunused -Wmissing-prototypes -Wmissing-declarations -Wstrict-prototypes  -Wmissing-prototypes -Wnested-externs -Wpointer-arith -Wno-cast-qual -Wcast-align -Wwrite-strings -mno-tls-direct-seg-refs  -DGC_LINUX_THREADS -D_GNU_SOURCE -D_REENTRANT -DUSE_MMAP -DUSE_MUNMAP -D_FILE_OFFSET_BITS=64  conftest.c  -ldl -lpthread -lm >&5
conftest.c:125: warning: function declaration isn't a prototype
conftest.c:135: warning: function declaration isn't a prototype
configure:35082: $? = 0
configure:35089: test -z "$ac_c_werror_flag" || test ! -s conftest.err
configure:35092: $? = 0
configure:35099: test -s conftest
configure:35102: $? = 0
configure:35116: result: yes
configure:35130: checking for fstatfs
configure:35186: i686-pc-linux-gnu-gcc -o conftest -g -O2 -fno-strict-aliasing -Wdeclaration-after-statement -g -Wall -Wunused -Wmissing-prototypes -Wmissing-declarations -Wstrict-prototypes  -Wmissing-prototypes -Wnested-externs -Wpointer-arith -Wno-cast-qual -Wcast-align -Wwrite-strings -mno-tls-direct-seg-refs  -DGC_LINUX_THREADS -D_GNU_SOURCE -D_REENTRANT -DUSE_MMAP -DUSE_MUNMAP -D_FILE_OFFSET_BITS=64  conftest.c  -ldl -lpthread -lm >&5
conftest.c:126: warning: function declaration isn't a prototype
conftest.c:136: warning: function declaration isn't a prototype
configure:35192: $? = 0
configure:35199: test -z "$ac_c_werror_flag" || test ! -s conftest.err
configure:35202: $? = 0
configure:35209: test -s conftest
configure:35212: $? = 0
configure:35226: result: yes
configure:35240: checking for statvfs
configure:35296: i686-pc-linux-gnu-gcc -o conftest -g -O2 -fno-strict-aliasing -Wdeclaration-after-statement -g -Wall -Wunused -Wmissing-prototypes -Wmissing-declarations -Wstrict-prototypes  -Wmissing-prototypes -Wnested-externs -Wpointer-arith -Wno-cast-qual -Wcast-align -Wwrite-strings -mno-tls-direct-seg-refs  -DGC_LINUX_THREADS -D_GNU_SOURCE -D_REENTRANT -DUSE_MMAP -DUSE_MUNMAP -D_FILE_OFFSET_BITS=64  conftest.c  -ldl -lpthread -lm >&5
conftest.c:127: warning: function declaration isn't a prototype
conftest.c:137: warning: function declaration isn't a prototype
configure:35302: $? = 0
configure:35309: test -z "$ac_c_werror_flag" || test ! -s conftest.err
configure:35312: $? = 0
configure:35319: test -s conftest
configure:35322: $? = 0
configure:35336: result: yes
configure:35350: checking for fstatvfs
configure:35406: i686-pc-linux-gnu-gcc -o conftest -g -O2 -fno-strict-aliasing -Wdeclaration-after-statement -g -Wall -Wunused -Wmissing-prototypes -Wmissing-declarations -Wstrict-prototypes  -Wmissing-prototypes -Wnested-externs -Wpointer-arith -Wno-cast-qual -Wcast-align -Wwrite-strings -mno-tls-direct-seg-refs  -DGC_LINUX_THREADS -D_GNU_SOURCE -D_REENTRANT -DUSE_MMAP -DUSE_MUNMAP -D_FILE_OFFSET_BITS=64  conftest.c  -ldl -lpthread -lm >&5
conftest.c:128: warning: function declaration isn't a prototype
conftest.c:138: warning: function declaration isn't a prototype
configure:35412: $? = 0
configure:35419: test -z "$ac_c_werror_flag" || test ! -s conftest.err
configure:35422: $? = 0
configure:35429: test -s conftest
configure:35432: $? = 0
configure:35446: result: yes
configure:35460: checking for stime
configure:35516: i686-pc-linux-gnu-gcc -o conftest -g -O2 -fno-strict-aliasing -Wdeclaration-after-statement -g -Wall -Wunused -Wmissing-prototypes -Wmissing-declarations -Wstrict-prototypes  -Wmissing-prototypes -Wnested-externs -Wpointer-arith -Wno-cast-qual -Wcast-align -Wwrite-strings -mno-tls-direct-seg-refs  -DGC_LINUX_THREADS -D_GNU_SOURCE -D_REENTRANT -DUSE_MMAP -DUSE_MUNMAP -D_FILE_OFFSET_BITS=64  conftest.c  -ldl -lpthread -lm >&5
conftest.c:129: warning: function declaration isn't a prototype
conftest.c:139: warning: function declaration isn't a prototype
configure:35522: $? = 0
configure:35529: test -z "$ac_c_werror_flag" || test ! -s conftest.err
configure:35532: $? = 0
configure:35539: test -s conftest
configure:35542: $? = 0
configure:35556: result: yes
configure:35570: checking for strerror_r
configure:35626: i686-pc-linux-gnu-gcc -o conftest -g -O2 -fno-strict-aliasing -Wdeclaration-after-statement -g -Wall -Wunused -Wmissing-prototypes -Wmissing-declarations -Wstrict-prototypes  -Wmissing-prototypes -Wnested-externs -Wpointer-arith -Wno-cast-qual -Wcast-align -Wwrite-strings -mno-tls-direct-seg-refs  -DGC_LINUX_THREADS -D_GNU_SOURCE -D_REENTRANT -DUSE_MMAP -DUSE_MUNMAP -D_FILE_OFFSET_BITS=64  conftest.c  -ldl -lpthread -lm >&5
conftest.c:130: warning: function declaration isn't a prototype
conftest.c:140: warning: function declaration isn't a prototype
configure:35632: $? = 0
configure:35639: test -z "$ac_c_werror_flag" || test ! -s conftest.err
configure:35642: $? = 0
configure:35649: test -s conftest
configure:35652: $? = 0
configure:35666: result: yes
configure:35680: checking for ttyname_r
configure:35736: i686-pc-linux-gnu-gcc -o conftest -g -O2 -fno-strict-aliasing -Wdeclaration-after-statement -g -Wall -Wunused -Wmissing-prototypes -Wmissing-declarations -Wstrict-prototypes  -Wmissing-prototypes -Wnested-externs -Wpointer-arith -Wno-cast-qual -Wcast-align -Wwrite-strings -mno-tls-direct-seg-refs  -DGC_LINUX_THREADS -D_GNU_SOURCE -D_REENTRANT -DUSE_MMAP -DUSE_MUNMAP -D_FILE_OFFSET_BITS=64  conftest.c  -ldl -lpthread -lm >&5
conftest.c:131: warning: function declaration isn't a prototype
conftest.c:141: warning: function declaration isn't a prototype
configure:35742: $? = 0
configure:35749: test -z "$ac_c_werror_flag" || test ! -s conftest.err
configure:35752: $? = 0
configure:35759: test -s conftest
configure:35762: $? = 0
configure:35776: result: yes
configure:35786: checking for size_t
configure:35816: i686-pc-linux-gnu-gcc -c -g -O2 -fno-strict-aliasing -Wdeclaration-after-statement -g -Wall -Wunused -Wmissing-prototypes -Wmissing-declarations -Wstrict-prototypes  -Wmissing-prototypes -Wnested-externs -Wpointer-arith -Wno-cast-qual -Wcast-align -Wwrite-strings -mno-tls-direct-seg-refs  -DGC_LINUX_THREADS -D_GNU_SOURCE -D_REENTRANT -DUSE_MMAP -DUSE_MUNMAP -D_FILE_OFFSET_BITS=64 conftest.c >&5
conftest.c:145: warning: function declaration isn't a prototype
configure:35822: $? = 0
configure:35829: test -z "$ac_c_werror_flag" || test ! -s conftest.err
configure:35832: $? = 0
configure:35839: test -s conftest.o
configure:35842: $? = 0
configure:35854: result: yes
configure:35857: checking size of size_t
configure:36245: i686-pc-linux-gnu-gcc -o conftest -g -O2 -fno-strict-aliasing -Wdeclaration-after-statement -g -Wall -Wunused -Wmissing-prototypes -Wmissing-declarations -Wstrict-prototypes  -Wmissing-prototypes -Wnested-externs -Wpointer-arith -Wno-cast-qual -Wcast-align -Wwrite-strings -mno-tls-direct-seg-refs  -DGC_LINUX_THREADS -D_GNU_SOURCE -D_REENTRANT -DUSE_MMAP -DUSE_MUNMAP -D_FILE_OFFSET_BITS=64  conftest.c  -ldl -lpthread -lm >&5
conftest.c:143: warning: function declaration isn't a prototype
conftest.c:144: warning: function declaration isn't a prototype
conftest.c:149: warning: function declaration isn't a prototype
configure:36248: $? = 0
configure:36254: ./conftest
configure:36257: $? = 0
configure:36279: result: 4
configure:36286: checking for blksize_t
configure:36319: i686-pc-linux-gnu-gcc -c -g -O2 -fno-strict-aliasing -Wdeclaration-after-statement -g -Wall -Wunused -Wmissing-prototypes -Wmissing-declarations -Wstrict-prototypes  -Wmissing-prototypes -Wnested-externs -Wpointer-arith -Wno-cast-qual -Wcast-align -Wwrite-strings -mno-tls-direct-seg-refs  -DGC_LINUX_THREADS -D_GNU_SOURCE -D_REENTRANT -DUSE_MMAP -DUSE_MUNMAP -D_FILE_OFFSET_BITS=64 conftest.c >&5
conftest.c:117: warning: function declaration isn't a prototype
configure:36325: $? = 0
configure:36332: test -z "$ac_c_werror_flag" || test ! -s conftest.err
configure:36335: $? = 0
configure:36342: test -s conftest.o
configure:36345: $? = 0
configure:36357: result: yes
configure:36371: checking for blkcnt_t
configure:36404: i686-pc-linux-gnu-gcc -c -g -O2 -fno-strict-aliasing -Wdeclaration-after-statement -g -Wall -Wunused -Wmissing-prototypes -Wmissing-declarations -Wstrict-prototypes  -Wmissing-prototypes -Wnested-externs -Wpointer-arith -Wno-cast-qual -Wcast-align -Wwrite-strings -mno-tls-direct-seg-refs  -DGC_LINUX_THREADS -D_GNU_SOURCE -D_REENTRANT -DUSE_MMAP -DUSE_MUNMAP -D_FILE_OFFSET_BITS=64 conftest.c >&5
conftest.c:119: warning: function declaration isn't a prototype
configure:36410: $? = 0
configure:36417: test -z "$ac_c_werror_flag" || test ! -s conftest.err
configure:36420: $? = 0
configure:36427: test -s conftest.o
configure:36430: $? = 0
configure:36442: result: yes
configure:36456: checking for suseconds_t
configure:36487: i686-pc-linux-gnu-gcc -c -g -O2 -fno-strict-aliasing -Wdeclaration-after-statement -g -Wall -Wunused -Wmissing-prototypes -Wmissing-declarations -Wstrict-prototypes  -Wmissing-prototypes -Wnested-externs -Wpointer-arith -Wno-cast-qual -Wcast-align -Wwrite-strings -mno-tls-direct-seg-refs  -DGC_LINUX_THREADS -D_GNU_SOURCE -D_REENTRANT -DUSE_MMAP -DUSE_MUNMAP -D_FILE_OFFSET_BITS=64 conftest.c >&5
conftest.c:119: warning: function declaration isn't a prototype
configure:36493: $? = 0
configure:36500: test -z "$ac_c_werror_flag" || test ! -s conftest.err
configure:36503: $? = 0
configure:36510: test -s conftest.o
configure:36513: $? = 0
configure:36525: result: yes
configure:36539: checking for struct pollfd
configure:36570: i686-pc-linux-gnu-gcc -c -g -O2 -fno-strict-aliasing -Wdeclaration-after-statement -g -Wall -Wunused -Wmissing-prototypes -Wmissing-declarations -Wstrict-prototypes  -Wmissing-prototypes -Wnested-externs -Wpointer-arith -Wno-cast-qual -Wcast-align -Wwrite-strings -mno-tls-direct-seg-refs  -DGC_LINUX_THREADS -D_GNU_SOURCE -D_REENTRANT -DUSE_MMAP -DUSE_MUNMAP -D_FILE_OFFSET_BITS=64 conftest.c >&5
conftest.c:121: warning: function declaration isn't a prototype
configure:36576: $? = 0
configure:36583: test -z "$ac_c_werror_flag" || test ! -s conftest.err
configure:36586: $? = 0
configure:36593: test -s conftest.o
configure:36596: $? = 0
configure:36608: result: yes
configure:36622: checking for struct stat
configure:36655: i686-pc-linux-gnu-gcc -c -g -O2 -fno-strict-aliasing -Wdeclaration-after-statement -g -Wall -Wunused -Wmissing-prototypes -Wmissing-declarations -Wstrict-prototypes  -Wmissing-prototypes -Wnested-externs -Wpointer-arith -Wno-cast-qual -Wcast-align -Wwrite-strings -mno-tls-direct-seg-refs  -DGC_LINUX_THREADS -D_GNU_SOURCE -D_REENTRANT -DUSE_MMAP -DUSE_MUNMAP -D_FILE_OFFSET_BITS=64 conftest.c >&5
conftest.c:125: warning: function declaration isn't a prototype
configure:36661: $? = 0
configure:36668: test -z "$ac_c_werror_flag" || test ! -s conftest.err
configure:36671: $? = 0
configure:36678: test -s conftest.o
configure:36681: $? = 0
configure:36693: result: yes
configure:36707: checking for struct timeval
configure:36740: i686-pc-linux-gnu-gcc -c -g -O2 -fno-strict-aliasing -Wdeclaration-after-statement -g -Wall -Wunused -Wmissing-prototypes -Wmissing-declarations -Wstrict-prototypes  -Wmissing-prototypes -Wnested-externs -Wpointer-arith -Wno-cast-qual -Wcast-align -Wwrite-strings -mno-tls-direct-seg-refs  -DGC_LINUX_THREADS -D_GNU_SOURCE -D_REENTRANT -DUSE_MMAP -DUSE_MUNMAP -D_FILE_OFFSET_BITS=64 conftest.c >&5
conftest.c:127: warning: function declaration isn't a prototype
configure:36746: $? = 0
configure:36753: test -z "$ac_c_werror_flag" || test ! -s conftest.err
configure:36756: $? = 0
configure:36763: test -s conftest.o
configure:36766: $? = 0
configure:36778: result: yes
configure:36792: checking for struct timezone
configure:36823: i686-pc-linux-gnu-gcc -c -g -O2 -fno-strict-aliasing -Wdeclaration-after-statement -g -Wall -Wunused -Wmissing-prototypes -Wmissing-declarations -Wstrict-prototypes  -Wmissing-prototypes -Wnested-externs -Wpointer-arith -Wno-cast-qual -Wcast-align -Wwrite-strings -mno-tls-direct-seg-refs  -DGC_LINUX_THREADS -D_GNU_SOURCE -D_REENTRANT -DUSE_MMAP -DUSE_MUNMAP -D_FILE_OFFSET_BITS=64 conftest.c >&5
conftest.c:127: warning: function declaration isn't a prototype
configure:36829: $? = 0
configure:36836: test -z "$ac_c_werror_flag" || test ! -s conftest.err
configure:36839: $? = 0
configure:36846: test -s conftest.o
configure:36849: $? = 0
configure:36861: result: yes
configure:36875: checking for struct dirent.d_off
configure:36905: i686-pc-linux-gnu-gcc -c -g -O2 -fno-strict-aliasing -Wdeclaration-after-statement -g -Wall -Wunused -Wmissing-prototypes -Wmissing-declarations -Wstrict-prototypes  -Wmissing-prototypes -Wnested-externs -Wpointer-arith -Wno-cast-qual -Wcast-align -Wwrite-strings -mno-tls-direct-seg-refs  -DGC_LINUX_THREADS -D_GNU_SOURCE -D_REENTRANT -DUSE_MMAP -DUSE_MUNMAP -D_FILE_OFFSET_BITS=64 conftest.c >&5
conftest.c:129: warning: function declaration isn't a prototype
configure:36911: $? = 0
configure:36918: test -z "$ac_c_werror_flag" || test ! -s conftest.err
configure:36921: $? = 0
configure:36928: test -s conftest.o
configure:36931: $? = 0
configure:37004: result: yes
configure:37014: checking for struct dirent.d_reclen
configure:37044: i686-pc-linux-gnu-gcc -c -g -O2 -fno-strict-aliasing -Wdeclaration-after-statement -g -Wall -Wunused -Wmissing-prototypes -Wmissing-declarations -Wstrict-prototypes  -Wmissing-prototypes -Wnested-externs -Wpointer-arith -Wno-cast-qual -Wcast-align -Wwrite-strings -mno-tls-direct-seg-refs  -DGC_LINUX_THREADS -D_GNU_SOURCE -D_REENTRANT -DUSE_MMAP -DUSE_MUNMAP -D_FILE_OFFSET_BITS=64 conftest.c >&5
conftest.c:130: warning: function declaration isn't a prototype
configure:37050: $? = 0
configure:37057: test -z "$ac_c_werror_flag" || test ! -s conftest.err
configure:37060: $? = 0
configure:37067: test -s conftest.o
configure:37070: $? = 0
configure:37143: result: yes
configure:37153: checking for struct dirent.d_type
configure:37183: i686-pc-linux-gnu-gcc -c -g -O2 -fno-strict-aliasing -Wdeclaration-after-statement -g -Wall -Wunused -Wmissing-prototypes -Wmissing-declarations -Wstrict-prototypes  -Wmissing-prototypes -Wnested-externs -Wpointer-arith -Wno-cast-qual -Wcast-align -Wwrite-strings -mno-tls-direct-seg-refs  -DGC_LINUX_THREADS -D_GNU_SOURCE -D_REENTRANT -DUSE_MMAP -DUSE_MUNMAP -D_FILE_OFFSET_BITS=64 conftest.c >&5
conftest.c:131: warning: function declaration isn't a prototype
configure:37189: $? = 0
configure:37196: test -z "$ac_c_werror_flag" || test ! -s conftest.err
configure:37199: $? = 0
configure:37206: test -s conftest.o
configure:37209: $? = 0
configure:37282: result: yes
configure:37294: checking for lsetxattr
configure:37350: i686-pc-linux-gnu-gcc -o conftest -g -O2 -fno-strict-aliasing -Wdeclaration-after-statement -g -Wall -Wunused -Wmissing-prototypes -Wmissing-declarations -Wstrict-prototypes  -Wmissing-prototypes -Wnested-externs -Wpointer-arith -Wno-cast-qual -Wcast-align -Wwrite-strings -mno-tls-direct-seg-refs  -DGC_LINUX_THREADS -D_GNU_SOURCE -D_REENTRANT -DUSE_MMAP -DUSE_MUNMAP -D_FILE_OFFSET_BITS=64  conftest.c  -ldl -lpthread -lm >&5
conftest.c:150: warning: function declaration isn't a prototype
conftest.c:160: warning: function declaration isn't a prototype
configure:37356: $? = 0
configure:37363: test -z "$ac_c_werror_flag" || test ! -s conftest.err
configure:37366: $? = 0
configure:37373: test -s conftest
configure:37376: $? = 0
configure:37389: result: yes
configure:37495: checking curses.h usability
configure:37512: i686-pc-linux-gnu-gcc -c -g -O2 -fno-strict-aliasing -Wdeclaration-after-statement -g -Wall -Wunused -Wmissing-prototypes -Wmissing-declarations -Wstrict-prototypes  -Wmissing-prototypes -Wnested-externs -Wpointer-arith -Wno-cast-qual -Wcast-align -Wwrite-strings -mno-tls-direct-seg-refs  -DGC_LINUX_THREADS -D_GNU_SOURCE -D_REENTRANT -DUSE_MMAP -DUSE_MUNMAP -D_FILE_OFFSET_BITS=64 conftest.c >&5
configure:37518: $? = 0
configure:37525: test -z "$ac_c_werror_flag" || test ! -s conftest.err
configure:37528: $? = 0
configure:37535: test -s conftest.o
configure:37538: $? = 0
configure:37549: result: yes
configure:37553: checking curses.h presence
configure:37568: i686-pc-linux-gnu-gcc -E  -DGC_LINUX_THREADS -D_GNU_SOURCE -D_REENTRANT -DUSE_MMAP -DUSE_MUNMAP -D_FILE_OFFSET_BITS=64 conftest.c
configure:37574: $? = 0
configure:37595: result: yes
configure:37623: checking for curses.h
configure:37631: result: yes
configure:37648: checking for term.h
configure:37672: i686-pc-linux-gnu-gcc -c -g -O2 -fno-strict-aliasing -Wdeclaration-after-statement -g -Wall -Wunused -Wmissing-prototypes -Wmissing-declarations -Wstrict-prototypes  -Wmissing-prototypes -Wnested-externs -Wpointer-arith -Wno-cast-qual -Wcast-align -Wwrite-strings -mno-tls-direct-seg-refs  -DGC_LINUX_THREADS -D_GNU_SOURCE -D_REENTRANT -DUSE_MMAP -DUSE_MUNMAP -D_FILE_OFFSET_BITS=64 conftest.c >&5
configure:37678: $? = 0
configure:37685: test -z "$ac_c_werror_flag" || test ! -s conftest.err
configure:37688: $? = 0
configure:37695: test -s conftest.o
configure:37698: $? = 0
configure:37711: result: yes
configure:37737: checking termios.h usability
configure:37754: i686-pc-linux-gnu-gcc -c -g -O2 -fno-strict-aliasing -Wdeclaration-after-statement -g -Wall -Wunused -Wmissing-prototypes -Wmissing-declarations -Wstrict-prototypes  -Wmissing-prototypes -Wnested-externs -Wpointer-arith -Wno-cast-qual -Wcast-align -Wwrite-strings -mno-tls-direct-seg-refs  -DGC_LINUX_THREADS -D_GNU_SOURCE -D_REENTRANT -DUSE_MMAP -DUSE_MUNMAP -D_FILE_OFFSET_BITS=64 conftest.c >&5
configure:37760: $? = 0
configure:37767: test -z "$ac_c_werror_flag" || test ! -s conftest.err
configure:37770: $? = 0
configure:37777: test -s conftest.o
configure:37780: $? = 0
configure:37791: result: yes
configure:37795: checking termios.h presence
configure:37810: i686-pc-linux-gnu-gcc -E  -DGC_LINUX_THREADS -D_GNU_SOURCE -D_REENTRANT -DUSE_MMAP -DUSE_MUNMAP -D_FILE_OFFSET_BITS=64 conftest.c
configure:37816: $? = 0
configure:37837: result: yes
configure:37865: checking for termios.h
configure:37873: result: yes
configure:38473: checking for socklen_t
configure:38501: i686-pc-linux-gnu-gcc -c -g -O2 -fno-strict-aliasing -Wdeclaration-after-statement -g -Wall -Wunused -Wmissing-prototypes -Wmissing-declarations -Wstrict-prototypes  -Wmissing-prototypes -Wnested-externs -Wpointer-arith -Wno-cast-qual -Wcast-align -Wwrite-strings -mno-tls-direct-seg-refs  -DGC_LINUX_THREADS -D_GNU_SOURCE -D_REENTRANT -DUSE_MMAP -DUSE_MUNMAP -D_FILE_OFFSET_BITS=64 conftest.c >&5
conftest.c:137: warning: function declaration isn't a prototype
conftest.c: In function `main':
conftest.c:139: warning: unused variable `foo'
configure:38507: $? = 0
configure:38514: test -z "$ac_c_werror_flag" || test ! -s conftest.err
configure:38517: $? = 0
configure:38524: test -s conftest.o
configure:38527: $? = 0
configure:38535: result: yes
configure:38550: checking for array element initalizer support
configure:38575: i686-pc-linux-gnu-gcc -c -g -O2 -fno-strict-aliasing -Wdeclaration-after-statement -g -Wall -Wunused -Wmissing-prototypes -Wmissing-declarations -Wstrict-prototypes  -Wmissing-prototypes -Wnested-externs -Wpointer-arith -Wno-cast-qual -Wcast-align -Wwrite-strings -mno-tls-direct-seg-refs  -DGC_LINUX_THREADS -D_GNU_SOURCE -D_REENTRANT -DUSE_MMAP -DUSE_MUNMAP -D_FILE_OFFSET_BITS=64 conftest.c >&5
conftest.c:135: warning: function declaration isn't a prototype
conftest.c: In function `main':
conftest.c:137: warning: unused variable `array'
configure:38581: $? = 0
configure:38588: test -z "$ac_c_werror_flag" || test ! -s conftest.err
configure:38591: $? = 0
configure:38598: test -s conftest.o
configure:38601: $? = 0
configure:38605: result: yes
configure:38630: checking for trunc
configure:38686: i686-pc-linux-gnu-gcc -o conftest -g -O2 -fno-strict-aliasing -Wdeclaration-after-statement -g -Wall -Wunused -Wmissing-prototypes -Wmissing-declarations -Wstrict-prototypes  -Wmissing-prototypes -Wnested-externs -Wpointer-arith -Wno-cast-qual -Wcast-align -Wwrite-strings -mno-tls-direct-seg-refs  -DGC_LINUX_THREADS -D_GNU_SOURCE -D_REENTRANT -DUSE_MMAP -DUSE_MUNMAP -D_FILE_OFFSET_BITS=64  conftest.c  -ldl -lpthread -lm >&5
conftest.c:156: warning: function declaration isn't a prototype
conftest.c:156: warning: conflicting types for built-in function 'trunc'
conftest.c:166: warning: function declaration isn't a prototype
configure:38692: $? = 0
configure:38699: test -z "$ac_c_werror_flag" || test ! -s conftest.err
configure:38702: $? = 0
configure:38709: test -s conftest
configure:38712: $? = 0
configure:38726: result: yes
configure:38810: checking for aintl in -lsunmath
configure:38845: i686-pc-linux-gnu-gcc -o conftest -g -O2 -fno-strict-aliasing -Wdeclaration-after-statement -g -Wall -Wunused -Wmissing-prototypes -Wmissing-declarations -Wstrict-prototypes  -Wmissing-prototypes -Wnested-externs -Wpointer-arith -Wno-cast-qual -Wcast-align -Wwrite-strings -mno-tls-direct-seg-refs  -DGC_LINUX_THREADS -D_GNU_SOURCE -D_REENTRANT -DUSE_MMAP -DUSE_MUNMAP -D_FILE_OFFSET_BITS=64  conftest.c -lsunmath   -ldl -lpthread -lm >&5
conftest.c:141: warning: function declaration isn't a prototype
conftest.c:144: warning: function declaration isn't a prototype
/usr/lib/gcc/i686-pc-linux-gnu/3.4.6/../../../../i686-pc-linux-gnu/bin/ld: cannot find -lsunmath
collect2: ld returned 1 exit status
configure:38851: $? = 1
configure: failed program was:
| /* confdefs.h.  */
| #define PACKAGE_NAME ""
| #define PACKAGE_TARNAME ""
| #define PACKAGE_VERSION ""
| #define PACKAGE_STRING ""
| #define PACKAGE_BUGREPORT ""
| #define PACKAGE "mono"
| #define VERSION "1.2"
| #define STDC_HEADERS 1
| #define HAVE_SYS_TYPES_H 1
| #define HAVE_SYS_STAT_H 1
| #define HAVE_STDLIB_H 1
| #define HAVE_STRING_H 1
| #define HAVE_MEMORY_H 1
| #define HAVE_STRINGS_H 1
| #define HAVE_INTTYPES_H 1
| #define HAVE_STDINT_H 1
| #define HAVE_UNISTD_H 1
| #define HAVE_DLFCN_H 1
| #define HAVE_NETDB_H 1
| #define HAVE_UTIME_H 1
| #define HAVE_SEMAPHORE_H 1
| #define HAVE_SYS_UN_H 1
| #define HAVE_LINUX_RTC_H 1
| #define HAVE_SYS_SYSCALL_H 1
| #define HAVE_ELF_H 1
| #define HAVE_POLL_H 1
| #define HAVE_SYS_POLL_H 1
| #define HAVE_SYS_WAIT_H 1
| #define HAVE_GRP_H 1
| #define HAVE_SYSLOG_H 1
| #define HAVE_WCHAR_H 1
| #define HAVE_ISINF 1
| #define SIZEOF_VOID_P 4
| #define MONO_XEN_OPT 1
| #define DISABLED_FEATURES "none"
| #define HAVE_BOEHM_GC 1
| #define HAVE_GC_H 1
| #define USE_INCLUDED_LIBGC 1
| #define HAVE_GC_GCJ_MALLOC 1
| #define HAVE_GC_ENABLE 1
| #define USED_GC_NAME "Included Boehm (with typed GC)"
| #define HAVE_DL_LOADER 1
| #define HAVE_EXECINFO_H 1
| #define HAVE_GETGRGID_R 1
| #define HAVE_GETGRNAM_R 1
| #define HAVE_GETPWNAM_R 1
| #define HAVE_GETPWUID_R 1
| #define HAVE_GETRESUID 1
| #define HAVE_SETRESUID 1
| #define HAVE_BACKTRACE_SYMBOLS 1
| #define HAVE_MKSTEMP 1
| #define HAVE_MMAP 1
| #define HAVE_MADVISE 1
| #define HAVE_LARGE_FILE_SUPPORT 1
| #define HAVE_MSG_NOSIGNAL 1
| #define HAVE_SOL_IP 1
| #define HAVE_SOL_IPV6 1
| #define HAVE_IP_PKTINFO 1
| #define HAVE_IPV6_PKTINFO 1
| #define HAVE_STRUCT_IP_MREQN 1
| #define HAVE_GETHOSTBYNAME2_R 1
| #define HAVE_INET_PTON 1
| #define HAVE_INET_ATON 1
| #define MONO_SIZEOF_SUNPATH 108
| #define MONO_ZERO_ARRAY_LENGTH 0
| #define HAVE_PTHREAD_H 1
| #define HAVE_PTHREAD_MUTEX_TIMEDLOCK 1
| #define HAVE_PTHREAD_GETATTR_NP 1
| #define HAVE_PTHREAD_ATTR_SETSTACKSIZE 1
| #define HAVE_PTHREAD_ATTR_GETSTACK 1
| #define HAVE_TM_GMTOFF 1
| #define HAVE_FINITE 1
| #define HAVE_ISFINITE 1
| #define HAVE_POLL 1
| #define HAVE_SIGNBIT 1
| #define HAVE_SYS_EPOLL_H 1
| #define HAVE_EPOLL_CTL 1
| #define HAVE_EPOLL 1
| #define HAVE_SYS_IOCTL_H 1
| #define HAVE_NET_IF_H 1
| #define HAVE_SIOCGIFCONF 1
| #define HAVE_FSTAB_H 1
| #define HAVE_SYS_SENDFILE_H 1
| #define HAVE_SYS_STATVFS_H 1
| #define HAVE_SYS_XATTR_H 1
| #define HAVE_SYS_MMAN_H 1
| #define HAVE_GETDOMAINNAME 1
| #define HAVE_SETDOMAINNAME 1
| #define HAVE_FGETGRENT 1
| #define HAVE_FGETPWENT 1
| #define HAVE_FGETPWENT 1
| #define HAVE_MREMAP 1
| #define HAVE_REMAP_FILE_PAGES 1
| #define HAVE_POSIX_FADVISE 1
| #define HAVE_POSIX_FALLOCATE 1
| #define HAVE_POSIX_MADVISE 1
| #define HAVE_VSNPRINTF 1
| #define HAVE_SENDFILE 1
| #define HAVE_SETHOSTID 1
| #define HAVE_STATFS 1
| #define HAVE_FSTATFS 1
| #define HAVE_STATVFS 1
| #define HAVE_FSTATVFS 1
| #define HAVE_STIME 1
| #define HAVE_STRERROR_R 1
| #define HAVE_TTYNAME_R 1
| #define SIZEOF_SIZE_T 4
| #define HAVE_BLKSIZE_T 1
| #define HAVE_BLKSIZE_T 1
| #define HAVE_BLKCNT_T 1
| #define HAVE_BLKCNT_T 1
| #define HAVE_SUSECONDS_T 1
| #define HAVE_SUSECONDS_T 1
| #define HAVE_STRUCT_POLLFD 1
| #define HAVE_STRUCT_POLLFD 1
| #define HAVE_STRUCT_STAT 1
| #define HAVE_STRUCT_STAT 1
| #define HAVE_STRUCT_TIMEVAL 1
| #define HAVE_STRUCT_TIMEVAL 1
| #define HAVE_STRUCT_TIMEZONE 1
| #define HAVE_STRUCT_TIMEZONE 1
| #define HAVE_STRUCT_DIRENT_D_OFF 1
| #define HAVE_STRUCT_DIRENT_D_RECLEN 1
| #define HAVE_STRUCT_DIRENT_D_TYPE 1
| #define HAVE_CURSES_H 1
| #define HAVE_TERM_H 1
| #define HAVE_TERMIOS_H 1
| #define HAVE_GETPROCESSID 1
| #define HAVE_SOCKLEN_T 1
| #define HAVE_ARRAY_ELEM_INIT 1
| #define HAVE_TRUNC 1
| /* end confdefs.h.  */
| 
| /* Override any GCC internal prototype to avoid an error.
|    Use char because int might match the return type of a GCC
|    builtin and then its argument prototype would still apply.  */
| #ifdef __cplusplus
| extern "C"
| #endif
| char aintl ();
| int
| main ()
| {
| return aintl ();
|   ;
|   return 0;
| }
configure:38885: result: no
configure:38897: checking if usage of random device is requested
configure:38906: result: yes
configure:38932: checking for random device
configure:38940: result: yes
configure:38993: checking if inter-process shared handles are requested
configure:39002: result: no
configure:39386: checking for X
configure:39501: i686-pc-linux-gnu-gcc -E  -DGC_LINUX_THREADS -D_GNU_SOURCE -D_REENTRANT -DUSE_MMAP -DUSE_MUNMAP -D_FILE_OFFSET_BITS=64 conftest.c
configure:39507: $? = 0
configure:39563: i686-pc-linux-gnu-gcc -o conftest -g -O2 -fno-strict-aliasing -Wdeclaration-after-statement -g -Wall -Wunused -Wmissing-prototypes -Wmissing-declarations -Wstrict-prototypes  -Wmissing-prototypes -Wnested-externs -Wpointer-arith -Wno-cast-qual -Wcast-align -Wwrite-strings -mno-tls-direct-seg-refs  -DGC_LINUX_THREADS -D_GNU_SOURCE -D_REENTRANT -DUSE_MMAP -DUSE_MUNMAP -D_FILE_OFFSET_BITS=64  conftest.c -lXt  -ldl -lpthread -lm >&5
conftest.c:141: warning: function declaration isn't a prototype
configure:39569: $? = 0
configure:39576: test -z "$ac_c_werror_flag" || test ! -s conftest.err
configure:39579: $? = 0
configure:39586: test -s conftest
configure:39589: $? = 0
configure:39644: result: libraries , headers 
configure:39648: checking for the soname of libX11.so
configure:39654: result: libX11.so.6
configure:39687: checking valgrind/memcheck.h usability
configure:39704: i686-pc-linux-gnu-gcc -c -g -O2 -fno-strict-aliasing -Wdeclaration-after-statement -g -Wall -Wunused -Wmissing-prototypes -Wmissing-declarations -Wstrict-prototypes  -Wmissing-prototypes -Wnested-externs -Wpointer-arith -Wno-cast-qual -Wcast-align -Wwrite-strings -mno-tls-direct-seg-refs  -DGC_LINUX_THREADS -D_GNU_SOURCE -D_REENTRANT -DUSE_MMAP -DUSE_MUNMAP -D_FILE_OFFSET_BITS=64 conftest.c >&5
configure:39710: $? = 0
configure:39717: test -z "$ac_c_werror_flag" || test ! -s conftest.err
configure:39720: $? = 0
configure:39727: test -s conftest.o
configure:39730: $? = 0
configure:39741: result: yes
configure:39745: checking valgrind/memcheck.h presence
configure:39760: i686-pc-linux-gnu-gcc -E  -DGC_LINUX_THREADS -D_GNU_SOURCE -D_REENTRANT -DUSE_MMAP -DUSE_MUNMAP -D_FILE_OFFSET_BITS=64 conftest.c
configure:39766: $? = 0
configure:39787: result: yes
configure:39815: checking for valgrind/memcheck.h
configure:39823: result: yes
configure:39869: checking if the Mono Debugger is supported on this platform
configure:39878: result: yes
configure:39898: checking if the tls_model attribute is supported
configure:39922: i686-pc-linux-gnu-gcc -c -g -O2 -fno-strict-aliasing -Wdeclaration-after-statement -g -Wall -Wunused -Wmissing-prototypes -Wmissing-declarations -Wstrict-prototypes  -Wmissing-prototypes -Wnested-externs -Wpointer-arith -Wno-cast-qual -Wcast-align -Wwrite-strings -mno-tls-direct-seg-refs  -DGC_LINUX_THREADS -D_GNU_SOURCE -D_REENTRANT -DUSE_MMAP -DUSE_MUNMAP -D_FILE_OFFSET_BITS=64 -DUSE_COMPILER_TLS conftest.c >&5
conftest.c:144: warning: function declaration isn't a prototype
conftest.c:141: warning: 'foo' defined but not used
configure:39928: $? = 0
configure:39935: test -z "$ac_c_werror_flag" || test ! -s conftest.err
configure:39938: $? = 0
configure:39945: test -s conftest.o
configure:39948: $? = 0
configure:39951: result: yes
configure:40711: creating ./config.status

## ---------------------- ##
## Running config.status. ##
## ---------------------- ##

This file was extended by config.status, which was
generated by GNU Autoconf 2.60.  Invocation command line was

  CONFIG_FILES    = 
  CONFIG_HEADERS  = 
  CONFIG_LINKS    = 
  CONFIG_COMMANDS = 
  $ ./config.status 

on jupiter

config.status:825: creating runtime/mono-wrapper
config.status:825: creating runtime/monodis-wrapper
config.status:825: creating runtime/semdel-wrapper
config.status:825: creating Makefile
config.status:825: creating mint.pc
config.status:825: creating mono.pc
config.status:825: creating mono-cairo.pc
config.status:825: creating dotnet.pc
config.status:825: creating mono-uninstalled.pc
config.status:825: creating scripts/mono-nunit.pc
config.status:825: creating scripts/mono-find-provides
config.status:825: creating scripts/mono-find-requires
config.status:825: creating mono/Makefile
config.status:825: creating mono/utils/Makefile
config.status:825: creating mono/metadata/Makefile
config.status:825: creating mono/dis/Makefile
config.status:825: creating mono/cil/Makefile
config.status:825: creating mono/arch/Makefile
config.status:825: creating mono/os/Makefile
config.status:825: creating mono/arch/x86/Makefile
config.status:825: creating mono/arch/amd64/Makefile
config.status:825: creating mono/arch/hppa/Makefile
config.status:825: creating mono/arch/ppc/Makefile
config.status:825: creating mono/arch/sparc/Makefile
config.status:825: creating mono/arch/s390/Makefile
config.status:825: creating mono/arch/s390x/Makefile
config.status:825: creating mono/arch/arm/Makefile
config.status:825: creating mono/arch/alpha/Makefile
config.status:825: creating mono/arch/ia64/Makefile
config.status:825: creating mono/arch/mips/Makefile
config.status:825: creating mono/interpreter/Makefile
config.status:825: creating mono/tests/Makefile
config.status:825: creating mono/tests/tests-config
config.status:825: creating mono/tests/cas/Makefile
config.status:825: creating mono/tests/cas/assembly/Makefile
config.status:825: creating mono/tests/cas/demand/Makefile
config.status:825: creating mono/tests/cas/inheritance/Makefile
config.status:825: creating mono/tests/cas/linkdemand/Makefile
config.status:825: creating mono/tests/cas/threads/Makefile
config.status:825: creating mono/benchmark/Makefile
config.status:825: creating mono/monoburg/Makefile
config.status:825: creating mono/monograph/Makefile
config.status:825: creating mono/io-layer/Makefile
config.status:825: creating mono/mini/Makefile
config.status:825: creating mono/profiler/Makefile
config.status:825: creating ikvm-native/Makefile
config.status:825: creating scripts/Makefile
config.status:825: creating man/Makefile
config.status:825: creating web/Makefile
config.status:825: creating docs/Makefile
config.status:825: creating data/Makefile
config.status:825: creating data/net_1_1/Makefile
config.status:825: creating data/net_2_0/Makefile
config.status:825: creating samples/Makefile
config.status:825: creating support/Makefile
config.status:825: creating data/config
config.status:825: creating tools/Makefile
config.status:825: creating tools/locale-builder/Makefile
config.status:825: creating runtime/Makefile
config.status:825: creating config.h
config.status:1221: executing depfiles commands
config.status:1221: executing runtime/etc/mono/1.0/machine.config commands
config.status:1221: executing runtime/etc/mono/2.0/machine.config commands
config.status:1221: executing runtime/etc/mono/2.0/web.config commands
configure:42275: === configuring in libgc (/usr/local/src/mono/libgc)
configure:42378: running /bin/sh ./configure --prefix=/usr  '--host=i686-pc-linux-gnu' '--mandir=/usr/share/man' '--infodir=/usr/share/info' '--datadir=/usr/share' '--sysconfdir=/etc' '--localstatedir=/var/lib' '--with-preview=yes' '--with-glib=system' '--with-gc=included' '--with-tls=__thread' '--build=i686-pc-linux-gnu' '--disable-shared-handles' 'build_alias=i686-pc-linux-gnu' 'host_alias=i686-pc-linux-gnu' '--disable-embed-check' '--with-libgc-threads=pthreads' --cache-file=/dev/null --srcdir=.

## ---------------- ##
## Cache variables. ##
## ---------------- ##

ac_cv_build=i686-pc-linux-gnu
ac_cv_c_compiler_gnu=yes
ac_cv_c_socklen_t=yes
ac_cv_cxx_compiler_gnu=yes
ac_cv_env_BASE_DEPENDENCIES_CFLAGS_set=
ac_cv_env_BASE_DEPENDENCIES_CFLAGS_value=
ac_cv_env_BASE_DEPENDENCIES_LIBS_set=
ac_cv_env_BASE_DEPENDENCIES_LIBS_value=
ac_cv_env_CCC_set=
ac_cv_env_CCC_value=
ac_cv_env_CC_set=
ac_cv_env_CC_value=
ac_cv_env_CFLAGS_set=
ac_cv_env_CFLAGS_value=
ac_cv_env_CPPFLAGS_set=
ac_cv_env_CPPFLAGS_value=
ac_cv_env_CPP_set=
ac_cv_env_CPP_value=
ac_cv_env_CXXCPP_set=
ac_cv_env_CXXCPP_value=
ac_cv_env_CXXFLAGS_set=
ac_cv_env_CXXFLAGS_value=
ac_cv_env_CXX_set=
ac_cv_env_CXX_value=
ac_cv_env_F77_set=
ac_cv_env_F77_value=
ac_cv_env_FFLAGS_set=
ac_cv_env_FFLAGS_value=
ac_cv_env_LDFLAGS_set=
ac_cv_env_LDFLAGS_value=
ac_cv_env_PKG_CONFIG_set=
ac_cv_env_PKG_CONFIG_value=
ac_cv_env_XMKMF_set=
ac_cv_env_XMKMF_value=
ac_cv_env_build_alias_set=set
ac_cv_env_build_alias_value=i686-pc-linux-gnu
ac_cv_env_host_alias_set=set
ac_cv_env_host_alias_value=i686-pc-linux-gnu
ac_cv_env_target_alias_set=
ac_cv_env_target_alias_value=
ac_cv_f77_compiler_gnu=no
ac_cv_func_backtrace_symbols=yes
ac_cv_func_dlerror=yes
ac_cv_func_dlopen=no
ac_cv_func_epoll_ctl=yes
ac_cv_func_fgetgrent=yes
ac_cv_func_fgetpwent=yes
ac_cv_func_finite=yes
ac_cv_func_fstatfs=yes
ac_cv_func_fstatvfs=yes
ac_cv_func_getdomainname=yes
ac_cv_func_getfsstat=no
ac_cv_func_getgrgid_r=yes
ac_cv_func_getgrnam_r=yes
ac_cv_func_gethostbyaddr=yes
ac_cv_func_getpwnam_r=yes
ac_cv_func_getpwuid_r=yes
ac_cv_func_getresuid=yes
ac_cv_func_inet_aton=yes
ac_cv_func_inet_pton=yes
ac_cv_func_isfinite=no
ac_cv_func_kqueue=no
ac_cv_func_lsetxattr=yes
ac_cv_func_lutimes=no
ac_cv_func_madvise=yes
ac_cv_func_mkstemp=yes
ac_cv_func_mmap=yes
ac_cv_func_mremap=yes
ac_cv_func_poll=yes
ac_cv_func_posix_fadvise=yes
ac_cv_func_posix_fallocate=yes
ac_cv_func_posix_madvise=yes
ac_cv_func_pthread_attr_get_np=no
ac_cv_func_pthread_attr_getstack=yes
ac_cv_func_pthread_attr_setstacksize=yes
ac_cv_func_pthread_get_stackaddr_np=no
ac_cv_func_pthread_get_stacksize_np=no
ac_cv_func_pthread_getattr_np=yes
ac_cv_func_pthread_mutex_timedlock=yes
ac_cv_func_remap_file_pages=yes
ac_cv_func_sendfile=yes
ac_cv_func_setdomainname=yes
ac_cv_func_sethostid=yes
ac_cv_func_setresuid=yes
ac_cv_func_statfs=yes
ac_cv_func_statvfs=yes
ac_cv_func_stime=yes
ac_cv_func_strerror_r=yes
ac_cv_func_trunc=yes
ac_cv_func_ttyname_r=yes
ac_cv_func_vsnprintf=yes
ac_cv_have_dev_random=yes
ac_cv_have_x='have_x=yes	ac_x_includes='\'''\''	ac_x_libraries='\'''\'''
ac_cv_header_attr_xattr_h=no
ac_cv_header_checklist_h=no
ac_cv_header_curses_h=yes
ac_cv_header_dlfcn_h=yes
ac_cv_header_elf_h=yes
ac_cv_header_execinfo_h=yes
ac_cv_header_fstab_h=yes
ac_cv_header_grp_h=yes
ac_cv_header_ieeefp_h=no
ac_cv_header_inttypes_h=yes
ac_cv_header_linux_rtc_h=yes
ac_cv_header_memory_h=yes
ac_cv_header_net_if_h=yes
ac_cv_header_netdb_h=yes
ac_cv_header_poll_h=yes
ac_cv_header_pthread_h=yes
ac_cv_header_semaphore_h=yes
ac_cv_header_stdc=yes
ac_cv_header_stdint_h=yes
ac_cv_header_stdlib_h=yes
ac_cv_header_string_h=yes
ac_cv_header_strings_h=yes
ac_cv_header_sys_epoll_h=yes
ac_cv_header_sys_extattr_h=no
ac_cv_header_sys_filio_h=no
ac_cv_header_sys_ioctl_h=yes
ac_cv_header_sys_mman_h=yes
ac_cv_header_sys_poll_h=yes
ac_cv_header_sys_sendfile_h=yes
ac_cv_header_sys_sockio_h=no
ac_cv_header_sys_stat_h=yes
ac_cv_header_sys_statvfs_h=yes
ac_cv_header_sys_syscall_h=yes
ac_cv_header_sys_types_h=yes
ac_cv_header_sys_un_h=yes
ac_cv_header_sys_vfstab_h=no
ac_cv_header_sys_wait_h=yes
ac_cv_header_sys_xattr_h=yes
ac_cv_header_syslog_h=yes
ac_cv_header_term_h=yes
ac_cv_header_termios_h=yes
ac_cv_header_unistd_h=yes
ac_cv_header_utime_h=yes
ac_cv_header_valgrind_memcheck_h=yes
ac_cv_header_wchar_h=yes
ac_cv_header_zlib_h=yes
ac_cv_host=i686-pc-linux-gnu
ac_cv_lib_dl_dlopen=yes
ac_cv_lib_pthread_main=yes
ac_cv_lib_socket_socket=no
ac_cv_lib_sunmath_aintl=no
ac_cv_member_struct_dirent_d_off=yes
ac_cv_member_struct_dirent_d_reclen=yes
ac_cv_member_struct_dirent_d_type=yes
ac_cv_objext=o
ac_cv_path_EGREP='/bin/grep -E'
ac_cv_path_GREP=/bin/grep
ac_cv_path_PKG_CONFIG=/usr/bin/pkg-config
ac_cv_path_install='/usr/bin/install -c'
ac_cv_prog_AR=i686-pc-linux-gnu-ar
ac_cv_prog_AWK=gawk
ac_cv_prog_BISON=yes
ac_cv_prog_CC=i686-pc-linux-gnu-gcc
ac_cv_prog_CPP='i686-pc-linux-gnu-gcc -E'
ac_cv_prog_CXX=i686-pc-linux-gnu-g++
ac_cv_prog_CXXCPP='i686-pc-linux-gnu-g++ -E'
ac_cv_prog_RANLIB=i686-pc-linux-gnu-ranlib
ac_cv_prog_STRIP=i686-pc-linux-gnu-strip
ac_cv_prog_cc_c89=
ac_cv_prog_cc_g=yes
ac_cv_prog_cxx_g=yes
ac_cv_prog_f77_g=no
ac_cv_prog_make_make_set=yes
ac_cv_search_sem_init='none required'
ac_cv_sizeof_size_t=4
ac_cv_sizeof_void_p=4
ac_cv_struct_tm_gmtoff=yes
ac_cv_target=i686-pc-linux-gnu
ac_cv_type_blkcnt_t=yes
ac_cv_type_blksize_t=yes
ac_cv_type_size_t=yes
ac_cv_type_struct_pollfd=yes
ac_cv_type_struct_stat=yes
ac_cv_type_struct_timeval=yes
ac_cv_type_struct_timezone=yes
ac_cv_type_suseconds_t=yes
ac_cv_type_void_p=yes
am_cv_CC_dependencies_compiler_type=gcc3
am_cv_CXX_dependencies_compiler_type=gcc3
am_cv_prog_cc_stdc=
am_cv_prog_tar_ustar=gnutar
lt_cv_deplibs_check_method=pass_all
lt_cv_file_magic_cmd='$MAGIC_CMD'
lt_cv_file_magic_test_file=
lt_cv_ld_reload_flag=-r
lt_cv_objdir=.libs
lt_cv_path_LD=/usr/i686-pc-linux-gnu/bin/ld
lt_cv_path_LDCXX=/usr/i686-pc-linux-gnu/bin/ld
lt_cv_path_NM='/usr/bin/nm -B'
lt_cv_path_SED=/usr/bin/sed
lt_cv_prog_compiler_c_o=yes
lt_cv_prog_compiler_c_o_CXX=yes
lt_cv_prog_compiler_rtti_exceptions=no
lt_cv_prog_gnu_ld=yes
lt_cv_prog_gnu_ldcxx=yes
lt_cv_sys_global_symbol_pipe='sed -n -e '\''s/^.*[ 	]\([ABCDGIRSTW][ABCDGIRSTW]*\)[ 	][ 	]*\([_A-Za-z][_A-Za-z0-9]*\)$/\1 \2 \2/p'\'''
lt_cv_sys_global_symbol_to_c_name_address='sed -n -e '\''s/^: \([^ ]*\) $/  {\"\1\", (lt_ptr) 0},/p'\'' -e '\''s/^[BCDEGRST] \([^ ]*\) \([^ ]*\)$/  {"\2", (lt_ptr) \&\2},/p'\'''
lt_cv_sys_global_symbol_to_cdecl='sed -n -e '\''s/^. .* \(.*\)$/extern int \1;/p'\'''
lt_cv_sys_max_cmd_len=32768
lt_lt_cv_prog_compiler_c_o='"yes"'
lt_lt_cv_prog_compiler_c_o_CXX='"yes"'
lt_lt_cv_sys_global_symbol_pipe='"sed -n -e '\''s/^.*[ 	]\\([ABCDGIRSTW][ABCDGIRSTW]*\\)[ 	][ 	]*\\([_A-Za-z][_A-Za-z0-9]*\\)\$/\\1 \\2 \\2/p'\''"'
lt_lt_cv_sys_global_symbol_to_c_name_address='"sed -n -e '\''s/^: \\([^ ]*\\) \$/  {\\\"\\1\\\", (lt_ptr) 0},/p'\'' -e '\''s/^[BCDEGRST] \\([^ ]*\\) \\([^ ]*\\)\$/  {\"\\2\", (lt_ptr) \\&\\2},/p'\''"'
lt_lt_cv_sys_global_symbol_to_cdecl='"sed -n -e '\''s/^. .* \\(.*\\)\$/extern int \\1;/p'\''"'
mono_cv_uscore=no
pkg_cv_BASE_DEPENDENCIES_CFLAGS='-I/usr/include/glib-2.0 -I/usr/lib/glib-2.0/include  '
pkg_cv_BASE_DEPENDENCIES_LIBS='-lglib-2.0  '

## ----------------- ##
## Output variables. ##
## ----------------- ##

ACLOCAL='${SHELL} /usr/local/src/mono/missing --run aclocal-1.9'
ALPHA_FALSE=''
ALPHA_TRUE='#'
AMD64_FALSE=''
AMD64_TRUE='#'
AMDEPBACKSLASH='\'
AMDEP_FALSE='#'
AMDEP_TRUE=''
AMTAR='${SHELL} /usr/local/src/mono/missing --run tar'
API_VER='1.0'
AR='i686-pc-linux-gnu-ar'
ARM_FALSE=''
ARM_TRUE='#'
AS='as'
AUTOCONF='${SHELL} /usr/local/src/mono/missing --run autoconf'
AUTOHEADER='${SHELL} /usr/local/src/mono/missing --run autoheader'
AUTOMAKE='${SHELL} /usr/local/src/mono/missing --run automake-1.9'
AWK='gawk'
BASE_DEPENDENCIES_CFLAGS='-I/usr/include/glib-2.0 -I/usr/lib/glib-2.0/include  '
BASE_DEPENDENCIES_LIBS='-lglib-2.0  '
BISON='yes'
BUILD_EXEEXT=''
BUILD_GLIB_CFLAGS='-pthread -I/usr/include/glib-2.0 -I/usr/lib/glib-2.0/include  '
BUILD_GLIB_LIBS='-pthread -lgthread-2.0 -lglib-2.0  '
BUILD_MCS_FALSE='#'
BUILD_MCS_TRUE=''
CC='i686-pc-linux-gnu-gcc'
CCAS='$(CC)'
CCASFLAGS='$(CFLAGS)'
CCDEPMODE='depmode=gcc3'
CC_FOR_BUILD='i686-pc-linux-gnu-gcc'
CFLAGS='-g -O2 -fno-strict-aliasing -Wdeclaration-after-statement -g -Wall -Wunused -Wmissing-prototypes -Wmissing-declarations -Wstrict-prototypes  -Wmissing-prototypes -Wnested-externs -Wpointer-arith -Wno-cast-qual -Wcast-align -Wwrite-strings -mno-tls-direct-seg-refs'
CFLAGS_FOR_BUILD='-g -O2'
CPP='i686-pc-linux-gnu-gcc -E'
CPPFLAGS=' -DGC_LINUX_THREADS -D_GNU_SOURCE -D_REENTRANT -DUSE_MMAP -DUSE_MUNMAP -D_FILE_OFFSET_BITS=64 -DUSE_COMPILER_TLS'
CROSS_COMPILING_FALSE=''
CROSS_COMPILING_TRUE='#'
CXX='i686-pc-linux-gnu-g++'
CXXCPP='i686-pc-linux-gnu-g++ -E'
CXXDEPMODE='depmode=gcc3'
CXXFLAGS='-g -O2'
CYGPATH_W='echo'
DEFS='-DHAVE_CONFIG_H'
DEPDIR='.deps'
DISABLE_SHARED_HANDLES=''
DLLTOOL='dlltool'
ECHO='echo'
ECHO_C=''
ECHO_N='-n'
ECHO_T=''
EGLIB_BUILD_FALSE=''
EGLIB_BUILD_TRUE='#'
EGREP='/bin/grep -E'
ENABLE_NUNIT_TESTS_FALSE=''
ENABLE_NUNIT_TESTS_TRUE='#'
EXEEXT=''
F77=''
FFLAGS=''
GLIB_CFLAGS='-pthread -I/usr/include/glib-2.0 -I/usr/lib/glib-2.0/include  '
GLIB_LIBS='-pthread -lgthread-2.0 -lglib-2.0  '
GMODULE_CFLAGS='-I/usr/include/glib-2.0 -I/usr/lib/glib-2.0/include  '
GMODULE_LIBS='-Wl,--export-dynamic -lgmodule-2.0 -ldl -lglib-2.0  '
GREP='/bin/grep'
HAVE_BOEHM_GC=''
HAVE_ZLIB_FALSE='#'
HAVE_ZLIB_TRUE=''
HOST_CC=''
HPPA_FALSE=''
HPPA_TRUE='#'
IA64_FALSE=''
IA64_TRUE='#'
INCLUDED_LIBGC_FALSE='#'
INCLUDED_LIBGC_TRUE=''
INSTALL_2_0_FALSE='#'
INSTALL_2_0_TRUE=''
INSTALL_DATA='${INSTALL} -m 644'
INSTALL_PROGRAM='${INSTALL}'
INSTALL_SCRIPT='${INSTALL}'
INSTALL_STRIP_PROGRAM='${SHELL} $(install_sh) -c -s'
INTERP_SUPPORTED_FALSE=''
INTERP_SUPPORTED_TRUE='#'
INTL='libc.so.6'
JIT_SUPPORTED_FALSE='#'
JIT_SUPPORTED_TRUE=''
LDFLAGS=''
LIBC='libc.so.6'
LIBGC_CFLAGS='-I$(top_srcdir)/libgc/include'
LIBGC_LIBS='$(top_builddir)/libgc/libmonogc.la'
LIBGC_STATIC_LIBS='$(top_builddir)/libgc/libmonogc-static.la'
LIBOBJS=''
LIBS=' -ldl -lpthread -lm'
LIBTOOL='$(SHELL) $(top_builddir)/libtool'
LN_S='ln -s'
LTLIBOBJS=''
M68K_FALSE=''
M68K_TRUE='#'
MAINT='#'
MAINTAINER_MODE_FALSE=''
MAINTAINER_MODE_TRUE='#'
MAKEINFO='${SHELL} /usr/local/src/mono/missing --run makeinfo'
MIPS_FALSE=''
MIPS_GCC_FALSE=''
MIPS_GCC_TRUE='#'
MIPS_SGI_FALSE=''
MIPS_SGI_TRUE='#'
MIPS_TRUE='#'
MONO_DEBUGGER_SUPPORTED_FALSE='#'
MONO_DEBUGGER_SUPPORTED_TRUE=''
MONO_DL_NEED_USCORE='0'
NO_VERSION_SCRIPT_FALSE=''
NO_VERSION_SCRIPT_TRUE='#'
OBJDUMP='objdump'
OBJEXT='o'
PACKAGE='mono'
PACKAGE_BUGREPORT=''
PACKAGE_NAME=''
PACKAGE_STRING=''
PACKAGE_TARNAME=''
PACKAGE_VERSION=''
PATH_SEPARATOR=':'
PKG_CONFIG='/usr/bin/pkg-config'
PLATFORM_WIN32_FALSE=''
PLATFORM_WIN32_TRUE='#'
POWERPC_FALSE=''
POWERPC_TRUE='#'
RANLIB='i686-pc-linux-gnu-ranlib'
S390_FALSE=''
S390_TRUE='#'
S390x_FALSE=''
S390x_TRUE='#'
SET_MAKE=''
SHELL='/bin/sh'
SPARC64_FALSE=''
SPARC64_TRUE='#'
SPARC_FALSE=''
SPARC_TRUE='#'
SQLITE3='libsqlite3.so.0'
SQLITE='libsqlite.so.0'
STATIC_MONO_FALSE='#'
STATIC_MONO_TRUE=''
STRIP='i686-pc-linux-gnu-strip'
USE_JIT_FALSE='#'
USE_JIT_TRUE=''
VERSION='1.2'
X11='libX11.so.6'
X86_FALSE='#'
X86_TRUE=''
XATTR_LIB=''
XMKMF=''
ac_ct_CC=''
ac_ct_CXX=''
ac_ct_F77=''
am__fastdepCC_FALSE='#'
am__fastdepCC_TRUE=''
am__fastdepCXX_FALSE='#'
am__fastdepCXX_TRUE=''
am__include='include'
am__leading_dot='.'
am__quote=''
am__tar='tar --format=ustar -chf - "$$tardir"'
am__untar='tar -xf -'
arch_target='x86'
bindir='${exec_prefix}/bin'
build='i686-pc-linux-gnu'
build_alias='i686-pc-linux-gnu'
build_cpu='i686'
build_os='linux-gnu'
build_vendor='pc'
datadir='/usr/share'
datarootdir='${prefix}/share'
docdir='${datarootdir}/doc/${PACKAGE}'
dvidir='${docdir}'
exec_prefix='${prefix}'
host='i686-pc-linux-gnu'
host_alias='i686-pc-linux-gnu'
host_cpu='i686'
host_os='linux-gnu'
host_vendor='pc'
htmldir='${docdir}'
ikvm_native_dir='ikvm-native'
includedir='${prefix}/include'
infodir='/usr/share/info'
install_sh='/usr/local/src/mono/install-sh'
libdir='${exec_prefix}/lib'
libexecdir='${exec_prefix}/libexec'
libgc_dir='libgc'
libgdiplus_loc=''
libmono_cflags='-D_REENTRANT'
libmono_ldflags='-lpthread'
libsuffix='.so'
localedir='${datarootdir}/locale'
localstatedir='/var/lib'
mandir='/usr/share/man'
mcs_topdir='$(top_srcdir)/../mcs'
mcs_topdir_from_srcdir='$(top_builddir)/../mcs'
mkdir_p='mkdir -p --'
mono_build_root='/usr/local/src/mono'
mono_cfg_dir='/usr/local/src/mono/runtime/etc'
mono_runtime='mono/mini/mono'
oldincludedir='/usr/include'
pdfdir='${docdir}'
prefix='/usr'
program_transform_name='s,x,x,'
psdir='${docdir}'
reloc_libdir='lib'
sbindir='${exec_prefix}/sbin'
sharedstatedir='${prefix}/com'
subdirs=' libgc'
sysconfdir='/etc'
target='i686-pc-linux-gnu'
target_alias=''
target_cpu='i686'
target_os='linux-gnu'
target_vendor='pc'

## ----------- ##
## confdefs.h. ##
## ----------- ##

#define PACKAGE_NAME ""
#define PACKAGE_TARNAME ""
#define PACKAGE_VERSION ""
#define PACKAGE_STRING ""
#define PACKAGE_BUGREPORT ""
#define PACKAGE "mono"
#define VERSION "1.2"
#define STDC_HEADERS 1
#define HAVE_SYS_TYPES_H 1
#define HAVE_SYS_STAT_H 1
#define HAVE_STDLIB_H 1
#define HAVE_STRING_H 1
#define HAVE_MEMORY_H 1
#define HAVE_STRINGS_H 1
#define HAVE_INTTYPES_H 1
#define HAVE_STDINT_H 1
#define HAVE_UNISTD_H 1
#define HAVE_DLFCN_H 1
#define HAVE_NETDB_H 1
#define HAVE_UTIME_H 1
#define HAVE_SEMAPHORE_H 1
#define HAVE_SYS_UN_H 1
#define HAVE_LINUX_RTC_H 1
#define HAVE_SYS_SYSCALL_H 1
#define HAVE_ELF_H 1
#define HAVE_POLL_H 1
#define HAVE_SYS_POLL_H 1
#define HAVE_SYS_WAIT_H 1
#define HAVE_GRP_H 1
#define HAVE_SYSLOG_H 1
#define HAVE_WCHAR_H 1
#define HAVE_ISINF 1
#define SIZEOF_VOID_P 4
#define MONO_XEN_OPT 1
#define DISABLED_FEATURES "none"
#define HAVE_BOEHM_GC 1
#define HAVE_GC_H 1
#define USE_INCLUDED_LIBGC 1
#define HAVE_GC_GCJ_MALLOC 1
#define HAVE_GC_ENABLE 1
#define USED_GC_NAME "Included Boehm (with typed GC)"
#define HAVE_DL_LOADER 1
#define HAVE_EXECINFO_H 1
#define HAVE_GETGRGID_R 1
#define HAVE_GETGRNAM_R 1
#define HAVE_GETPWNAM_R 1
#define HAVE_GETPWUID_R 1
#define HAVE_GETRESUID 1
#define HAVE_SETRESUID 1
#define HAVE_BACKTRACE_SYMBOLS 1
#define HAVE_MKSTEMP 1
#define HAVE_MMAP 1
#define HAVE_MADVISE 1
#define HAVE_LARGE_FILE_SUPPORT 1
#define HAVE_MSG_NOSIGNAL 1
#define HAVE_SOL_IP 1
#define HAVE_SOL_IPV6 1
#define HAVE_IP_PKTINFO 1
#define HAVE_IPV6_PKTINFO 1
#define HAVE_STRUCT_IP_MREQN 1
#define HAVE_GETHOSTBYNAME2_R 1
#define HAVE_INET_PTON 1
#define HAVE_INET_ATON 1
#define MONO_SIZEOF_SUNPATH 108
#define MONO_ZERO_ARRAY_LENGTH 0
#define HAVE_PTHREAD_H 1
#define HAVE_PTHREAD_MUTEX_TIMEDLOCK 1
#define HAVE_PTHREAD_GETATTR_NP 1
#define HAVE_PTHREAD_ATTR_SETSTACKSIZE 1
#define HAVE_PTHREAD_ATTR_GETSTACK 1
#define HAVE_TM_GMTOFF 1
#define HAVE_FINITE 1
#define HAVE_ISFINITE 1
#define HAVE_POLL 1
#define HAVE_SIGNBIT 1
#define HAVE_SYS_EPOLL_H 1
#define HAVE_EPOLL_CTL 1
#define HAVE_EPOLL 1
#define HAVE_SYS_IOCTL_H 1
#define HAVE_NET_IF_H 1
#define HAVE_SIOCGIFCONF 1
#define HAVE_FSTAB_H 1
#define HAVE_SYS_SENDFILE_H 1
#define HAVE_SYS_STATVFS_H 1
#define HAVE_SYS_XATTR_H 1
#define HAVE_SYS_MMAN_H 1
#define HAVE_GETDOMAINNAME 1
#define HAVE_SETDOMAINNAME 1
#define HAVE_FGETGRENT 1
#define HAVE_FGETPWENT 1
#define HAVE_FGETPWENT 1
#define HAVE_MREMAP 1
#define HAVE_REMAP_FILE_PAGES 1
#define HAVE_POSIX_FADVISE 1
#define HAVE_POSIX_FALLOCATE 1
#define HAVE_POSIX_MADVISE 1
#define HAVE_VSNPRINTF 1
#define HAVE_SENDFILE 1
#define HAVE_SETHOSTID 1
#define HAVE_STATFS 1
#define HAVE_FSTATFS 1
#define HAVE_STATVFS 1
#define HAVE_FSTATVFS 1
#define HAVE_STIME 1
#define HAVE_STRERROR_R 1
#define HAVE_TTYNAME_R 1
#define SIZEOF_SIZE_T 4
#define HAVE_BLKSIZE_T 1
#define HAVE_BLKSIZE_T 1
#define HAVE_BLKCNT_T 1
#define HAVE_BLKCNT_T 1
#define HAVE_SUSECONDS_T 1
#define HAVE_SUSECONDS_T 1
#define HAVE_STRUCT_POLLFD 1
#define HAVE_STRUCT_POLLFD 1
#define HAVE_STRUCT_STAT 1
#define HAVE_STRUCT_STAT 1
#define HAVE_STRUCT_TIMEVAL 1
#define HAVE_STRUCT_TIMEVAL 1
#define HAVE_STRUCT_TIMEZONE 1
#define HAVE_STRUCT_TIMEZONE 1
#define HAVE_STRUCT_DIRENT_D_OFF 1
#define HAVE_STRUCT_DIRENT_D_RECLEN 1
#define HAVE_STRUCT_DIRENT_D_TYPE 1
#define HAVE_CURSES_H 1
#define HAVE_TERM_H 1
#define HAVE_TERMIOS_H 1
#define HAVE_GETPROCESSID 1
#define HAVE_SOCKLEN_T 1
#define HAVE_ARRAY_ELEM_INIT 1
#define HAVE_TRUNC 1
#define NAME_DEV_RANDOM "/dev/random"
#define HAVE_CRYPT_RNG 1
#define DISABLE_SHARED_HANDLES 1
#define HAVE_VISIBILITY_HIDDEN 1
#define HAVE_VALGRIND_MEMCHECK_H 1
#define MONO_DEBUGGER_SUPPORTED 1
#define HAVE_KW_THREAD 1
#define HAVE_TLS_MODEL_ATTR 1

configure: exit 0

## ---------------------- ##
## Running config.status. ##
## ---------------------- ##

This file was extended by config.status, which was
generated by GNU Autoconf 2.60.  Invocation command line was

  CONFIG_FILES    = 
  CONFIG_HEADERS  = 
  CONFIG_LINKS    = 
  CONFIG_COMMANDS = 
  $ ./config.status runtime/etc/mono/1.0/machine.config

on jupiter

config.status:1221: executing runtime/etc/mono/1.0/machine.config commands

## ---------------------- ##
## Running config.status. ##
## ---------------------- ##

This file was extended by config.status, which was
generated by GNU Autoconf 2.60.  Invocation command line was

  CONFIG_FILES    = 
  CONFIG_HEADERS  = 
  CONFIG_LINKS    = 
  CONFIG_COMMANDS = 
  $ ./config.status runtime/etc/mono/2.0/machine.config

on jupiter

config.status:1221: executing runtime/etc/mono/2.0/machine.config commands

## ---------------------- ##
## Running config.status. ##
## ---------------------- ##

This file was extended by config.status, which was
generated by GNU Autoconf 2.60.  Invocation command line was

  CONFIG_FILES    = 
  CONFIG_HEADERS  = 
  CONFIG_LINKS    = 
  CONFIG_COMMANDS = 
  $ ./config.status runtime/etc/mono/2.0/web.config

on jupiter

config.status:1221: executing runtime/etc/mono/2.0/web.config commands