All pastes #34324 Raw Edit

SUNWxchat4Gman

public text v1 · immutable
#34324 ·published 2005-12-20 13:54 UTC
rendered paste body
--- command output follows --- started at Tue Dec 20 07:31:48 CST 2005

pkgbuild: Executing(%prep): /bin/bash /var/tmp/pkgbuild-tmp-1.11666
pkgbuild: + umask 022
pkgbuild: + uname -a
pkgbuild: SunOS E71007189 5.11 snv_28 i86pc i386 i86pc
pkgbuild: + cd /jds/packages/BUILD
pkgbuild: + cd /jds/packages/BUILD
pkgbuild: + rm -rf xchat-2.4.0
pkgbuild: + /usr/sfw/bin/gtar xf -
pkgbuild: + /usr/bin/bzip2 -dc /jds/packages/SOURCES/xchat-2.4.0.tar.bz2
pkgbuild: + STATUS=0
pkgbuild: + '[' 0 -ne 0 ']'
pkgbuild: + cd xchat-2.4.0
pkgbuild: ++ /usr/xpg4/bin/id -u
pkgbuild: + '[' 100 = 0 ']'
pkgbuild: ++ /usr/xpg4/bin/id -u
pkgbuild: + '[' 100 = 0 ']'
pkgbuild: + /bin/chmod -Rf a+rX,g-w,o-w .
pkgbuild: + echo 'Patch #1 (xchat-01-gettext.diff):'
pkgbuild: Patch #1 (xchat-01-gettext.diff):
pkgbuild: + /usr/bin/gpatch -p 1
pkgbuild: patching file configure.in
pkgbuild: Hunk #1 FAILED at 11.
pkgbuild: Hunk #2 succeeded at 140 (offset -6 lines).
pkgbuild: Hunk #3 succeeded at 324 (offset -3 lines).
pkgbuild: 1 out of 3 hunks FAILED -- saving rejects to file configure.in.rej
pkgbuild: can't find file to patch at input line 36
pkgbuild: Perhaps you used the wrong -p or --strip option?
pkgbuild: The text leading up to this was:
pkgbuild: --------------------------
pkgbuild: |--- xchat-2.6.0/plugins/dbus/Makefile.am-orig        2005-12-07 11:21:55.943060000 -0800
pkgbuild: |+++ xchat-2.6.0/plugins/dbus/Makefile.am     2005-12-07 11:22:07.914970000 -0800
pkgbuild: --------------------------
pkgbuild: File to patch:
pkgbuild: Skip this patch? [y]
pkgbuild: Skipping patch.
pkgbuild: 1 out of 1 hunk ignored
pkgbuild: Bad exit status from /var/tmp/pkgbuild-tmp-1.11666 (%prep)
--- command output ends --- finished at Tue Dec 20 07:31:50 CST 2005

INFO: pkgbuild -ba finished at Tue Dec 20 07:31:50 CST 2005

ERROR: SUNWxchat FAILED
INFO: Check the build log in /tmp/SUNWxchat.log for details