All pastes #33981 Raw Edit

Untitled

public cpp v1 · immutable
#33981 ·published 2005-12-17 18:32 UTC
rendered paste body
.libs/kspell_hspell_la.all_cpp.o(.text+0x566): In function `HSpellDict::HSpellDict[not-in-charge](QString const&)':: undefined reference to `hspell_init(dict_radix**, int)'.libs/kspell_hspell_la.all_cpp.o(.text+0x6d6): In function `HSpellDict::HSpellDict[in-charge](QString const&)':: undefined reference to `hspell_init(dict_radix**, int)'.libs/kspell_hspell_la.all_cpp.o(.text+0x81c): In function `HSpellDict::~HSpellDict [not-in-charge]()':: undefined reference to `hspell_uninit(dict_radix*)'.libs/kspell_hspell_la.all_cpp.o(.text+0x88c): In function `HSpellDict::~HSpellDict [in-charge]()':: undefined reference to `hspell_uninit(dict_radix*)'.libs/kspell_hspell_la.all_cpp.o(.text+0x8fc): In function `HSpellDict::~HSpellDict [in-charge deleting]()':: undefined reference to `hspell_uninit(dict_radix*)'.libs/kspell_hspell_la.all_cpp.o(.text+0x9ed): In function `HSpellDict::check(QString const&)':: undefined reference to `hspell_check_word(dict_radix*, char const*, int*)'.libs/kspell_hspell_la.all_cpp.o(.text+0xa02): In function `HSpellDict::check(QString const&)':: undefined reference to `hspell_is_canonic_gimatria(char const*)'.libs/kspell_hspell_la.all_cpp.o(.text+0xb91): In function `HSpellDict::suggest(QString const&)':: undefined reference to `corlist_init(corlist*)'.libs/kspell_hspell_la.all_cpp.o(.text+0xbd8): In function `HSpellDict::suggest(QString const&)':: undefined reference to `hspell_trycorrect(dict_radix*, char const*, corlist*)'.libs/kspell_hspell_la.all_cpp.o(.text+0xcd2): In function `HSpellDict::suggest(QString const&)':: undefined reference to `corlist_free(corlist*)'collect2: ld returned 1 exit statusmake[7]: *** [kspell_hspell.la] Error 1make[7]: Leaving directory `/home/sorg/konstruct/kde/kdelibs/work/kdelibs-3.5.0/kspell2/plugins/hspell'make[6]: *** [all-recursive] Error 1make[6]: Leaving directory `/home/sorg/konstruct/kde/kdelibs/work/kdelibs-3.5.0/kspell2/plugins'make[5]: *** [all-recursive] Error 1make[5]: Leaving directory `/home/sorg/konstruct/kde/kdelibs/work/kdelibs-3.5.0/kspell2'make[4]: *** [all-recursive] Error 1make[4]: Leaving directory `/home/sorg/konstruct/kde/kdelibs/work/kdelibs-3.5.0'make[3]: *** [all] Error 2make[3]: Leaving directory `/home/sorg/konstruct/kde/kdelibs/work/kdelibs-3.5.0'make[2]: *** [build-work/kdelibs-3.5.0/Makefile] Error 2make[2]: Leaving directory `/home/sorg/konstruct/kde/kdelibs'make[1]: *** [dep-../../kde/kdelibs] Error 2make[1]: Leaving directory `/home/sorg/konstruct/kde/kdebase'make: *** [dep-../../kde/kdebase] Error 2