All pastes #33958 Raw Edit

Miscellany

public text v1 · immutable
#33958 ·published 2005-12-17 11:09 UTC
rendered paste body
...
| make[1]: Leaving directory `/home/ph5/src/oe/build/tmp/work/openswan-2.2.0-r4/openswan-2.2.0/lib'
| make[1]: Entering directory `/home/ph5/src/oe/build/tmp/work/openswan-2.2.0-r4/openswan-2.2.0/programs'
| make[2]: Entering directory `/home/ph5/src/oe/build/tmp/work/openswan-2.2.0-r4/openswan-2.2.0/programs/spi'
| ccache arm-linux-gcc -march=armv5te -mtune=xscale -I/home/ph5/src/oe/build/tmp/staging/arm-linux/include -fexpensive-optimizations -fomit-frame-pointer -frename-registers -O2 -I/home/ph5/src/oe/build/tmp/staging/arm-linux/include -fexpensive-optimizations -fomit-frame-pointer -frename-registers -O2 -I../.. -I../../linux/include -I../../include -Wall -Wpointer-arith -Wcast-qual -Wstrict-prototypes -Wbad-function-cast  -DNAT_TRAVERSAL -DKERNEL_ALG -DIKE_ALG  -I/home/ph5/src/oe/build/tmp/staging/arm-linux/include -L/home/ph5/src/oe/build/tmp/staging/arm-linux/lib -Wl,-rpath-link,/home/ph5/src/oe/build/tmp/staging/arm-linux/lib -Wl,-O1  spi.c   -o spi
| /tmp/ccDAAZb3.o: In function `pfkey_register':
| spi.c:(.text+0x5b8): undefined reference to `pfkey_extensions_init'
| spi.c:(.text+0x5e8): undefined reference to `pfkey_msg_hdr_build'
| spi.c:(.text+0x614): undefined reference to `pfkey_extensions_free'
| spi.c:(.text+0x634): undefined reference to `pfkey_msg_build'
| spi.c:(.text+0x6ac): undefined reference to `pfkey_extensions_free'
| spi.c:(.text+0x6b4): undefined reference to `pfkey_msg_free'
| spi.c:(.text+0x6e8): undefined reference to `pfkey_extensions_free'
| spi.c:(.text+0x6f0): undefined reference to `pfkey_msg_free'
| /tmp/ccDAAZb3.o: In function `decode_esp':
| spi.c:(.text+0x784): undefined reference to `alg_info_esp_create_from_str'
| spi.c:(.text+0x7d4): undefined reference to `kernel_alg_proc_read'
| spi.c:(.text+0x7fc): undefined reference to `kernel_alg_esp_enc_ok'
| spi.c:(.text+0x810): undefined reference to `kernel_alg_esp_auth_ok'
| spi.c:(.text+0x824): undefined reference to `enum_name'
| spi.c:(.text+0x8d4): undefined reference to `enum_name'
| spi.c:(.text+0x91c): undefined reference to `auth_alg_names'
| spi.c:(.text+0x93c): undefined reference to `esp_transformid_names'
| /tmp/ccDAAZb3.o: In function `main':
| spi.c:(.text+0x98c): undefined reference to `tool_init_log'
| spi.c:(.text+0xe14): undefined reference to `tool_close_log'
| spi.c:(.text+0xe18): undefined reference to `tool_init_log'
| spi.c:(.text+0xe64): undefined reference to `atodata'
| spi.c:(.text+0xeb0): undefined reference to `atodata'
| spi.c:(.text+0xf60): undefined reference to `ttoaddr'
| spi.c:(.text+0xf98): undefined reference to `addrtot'
| spi.c:(.text+0x1124): undefined reference to `ttoaddr'
| spi.c:(.text+0x1158): undefined reference to `addrtot'
| spi.c:(.text+0x11f4): undefined reference to `ttosa'
| spi.c:(.text+0x1224): undefined reference to `addrtypeof'
| spi.c:(.text+0x1234): undefined reference to `anyaddr'
| spi.c:(.text+0x1240): undefined reference to `anyaddr'
| spi.c:(.text+0x124c): undefined reference to `anyaddr'
| spi.c:(.text+0x1304): undefined reference to `pfkey_lib_debug'
| spi.c:(.text+0x1308): undefined reference to `cur_debugging'
| spi.c:(.text+0x1470): undefined reference to `atodata'
| spi.c:(.text+0x14b8): undefined reference to `ttoaddr'
| spi.c:(.text+0x14ec): undefined reference to `addrtot'
| spi.c:(.text+0x1544): undefined reference to `atodata'
| spi.c:(.text+0x1658): undefined reference to `optionsfrom'
| spi.c:(.text+0x1664): undefined reference to `addrtypeof'
| spi.c:(.text+0x16ac): undefined reference to `anyaddr'
| spi.c:(.text+0x16bc): undefined reference to `anyaddr'
| spi.c:(.text+0x16cc): undefined reference to `anyaddr'
| spi.c:(.text+0x16e8): undefined reference to `anyaddr'
| spi.c:(.text+0x16f4): undefined reference to `anyaddr'
| /tmp/ccDAAZb3.o:spi.c:(.text+0x1700): more undefined references to `anyaddr' follow
| /tmp/ccDAAZb3.o: In function `main':
| spi.c:(.text+0x1720): undefined reference to `satot'
| spi.c:(.text+0x183c): undefined reference to `addrtypeof'
| spi.c:(.text+0x1860): undefined reference to `satot'
| spi.c:(.text+0x18f0): undefined reference to `kernel_alg_sadb_alg_get'
| spi.c:(.text+0x1984): undefined reference to `kernel_alg_sadb_alg_get'
| spi.c:(.text+0x1a5c): undefined reference to `pfkey_extensions_init'
| spi.c:(.text+0x1a7c): undefined reference to `proto2satype'
| spi.c:(.text+0x1ac8): undefined reference to `pfkey_msg_hdr_build'
| spi.c:(.text+0x1b90): undefined reference to `pfkey_sa_build'
| spi.c:(.text+0x1c38): undefined reference to `pfkey_lifetime_build'
| spi.c:(.text+0x1cf4): undefined reference to `pfkey_lifetime_build'
| spi.c:(.text+0x1d50): undefined reference to `addrtot'
| spi.c:(.text+0x1d74): undefined reference to `sockaddrof'
| spi.c:(.text+0x1d90): undefined reference to `pfkey_address_build'
| spi.c:(.text+0x1dc8): undefined reference to `sockaddrlenof'
| spi.c:(.text+0x1dec): undefined reference to `initaddr'
| spi.c:(.text+0x1e10): undefined reference to `addrtot'
| spi.c:(.text+0x1e50): undefined reference to `addrtot'
| spi.c:(.text+0x1e74): undefined reference to `sockaddrof'
| spi.c:(.text+0x1e90): undefined reference to `pfkey_address_build'
| spi.c:(.text+0x1ee0): undefined reference to `initaddr'
| spi.c:(.text+0x1efc): undefined reference to `addrtot'
| spi.c:(.text+0x1f60): undefined reference to `pfkey_key_build'
| spi.c:(.text+0x1fdc): undefined reference to `pfkey_msg_build'
| spi.c:(.text+0x2048): undefined reference to `pfkey_extensions_free'
| spi.c:(.text+0x2050): undefined reference to `pfkey_msg_free'
| spi.c:(.text+0x276c): undefined reference to `isanyaddr'
| spi.c:(.text+0x27e8): undefined reference to `initsaid'
| spi.c:(.text+0x2810): undefined reference to `pfkey_key_build'
| spi.c:(.text+0x28b4): undefined reference to `pfkey_extensions_free'
| spi.c:(.text+0x2c58): undefined reference to `pfkey_extensions_free'
| spi.c:(.text+0x2c60): undefined reference to `pfkey_msg_free'
| spi.c:(.text+0x2d54): undefined reference to `pfkey_extensions_init'
| spi.c:(.text+0x2dfc): undefined reference to `pfkey_extensions_free'
| spi.c:(.text+0x2e04): undefined reference to `pfkey_msg_free'
| spi.c:(.text+0x30f8): undefined reference to `pfkey_v2_sadb_type_string'
| spi.c:(.text+0x310c): undefined reference to `satype2name'
| spi.c:(.text+0x31e0): undefined reference to `pfkey_extensions_free'
| spi.c:(.text+0x3228): undefined reference to `sockaddrlenof'
| spi.c:(.text+0x3254): undefined reference to `pfkey_msg_parse'
| spi.c:(.text+0x3298): undefined reference to `addrtot'
| spi.c:(.text+0x3338): undefined reference to `addrtot'
| collect2: ld returned 1 exit status
| make[2]: *** [spi] Error 1
| make[2]: Leaving directory `/home/ph5/src/oe/build/tmp/work/openswan-2.2.0-r4/openswan-2.2.0/programs/spi'
| make[1]: *** [programs] Error 1
| make[1]: Leaving directory `/home/ph5/src/oe/build/tmp/work/openswan-2.2.0-r4/openswan-2.2.0/programs'
| make: *** [programs] Error 1
| FATAL: oe_runmake failed
NOTE: Task failed: /home/ph5/src/oe/build/tmp/work/openswan-2.2.0-r4/temp/log.do_compile.3819
NOTE: package openswan-2.2.0-r4: task do_compile: failed