All pastes #334809 Raw Edit

Unnamed

public text v1 · immutable
#334809 ·published 2007-01-31 21:57 UTC
rendered paste body
[plate@density shallot-0.0.1]$ make
rm -f shallot src/shallot.o
gcc -O3 -Wall -I/usr/local/include -c src/shallot.c -o src/shallot.o
src/shallot.c:39:24: error: openssl/bn.h: No such file or directory
src/shallot.c:40:25: error: openssl/rsa.h: No such file or directory
src/shallot.c:41:25: error: openssl/pem.h: No such file or directory
src/shallot.c:42:28: error: openssl/buffer.h: No such file or directory
src/shallot.c:43:28: error: openssl/engine.h: No such file or directory
src/shallot.c: In function âusageâ:
src/shallot.c:111: warning: implicit declaration of function âexitâ
src/shallot.c:111: warning: incompatible implicit declaration of built-in function âexitâ
src/shallot.c: In function âerrorâ:
src/shallot.c:165: warning: incompatible implicit declaration of built-in function âexitâ
src/shallot.c: At top level:
src/shallot.c:174: error: expected â)â before â*â token
src/shallot.c:209: error: expected â)â before â*â token
src/shallot.c:224: error: expected â)â before â*â token
src/shallot.c: In function âworkerâ:
src/shallot.c:275: error: âSHA_CTXâ undeclared (first use in this function)
src/shallot.c:275: error: (Each undeclared identifier is reported only once
src/shallot.c:275: error: for each function it appears in.)
src/shallot.c:275: error: expected â;â before âhashâ
src/shallot.c:278: error: âRSAâ undeclared (first use in this function)
src/shallot.c:278: error: ârsaâ undeclared (first use in this function)
src/shallot.c:278: warning: implicit declaration of function âRSA_generate_keyâ
src/shallot.c:284: warning: implicit declaration of function âBN_add_wordâ
src/shallot.c:287: warning: implicit declaration of function âi2d_RSAPublicKeyâ
src/shallot.c:290: warning: implicit declaration of function âSHA1_Initâ
src/shallot.c:290: error: âhashâ undeclared (first use in this function)
src/shallot.c:291: warning: implicit declaration of function âSHA1_Updateâ
src/shallot.c:292: warning: implicit declaration of function âSHA1_Finalâ
src/shallot.c:302: warning: implicit declaration of function âsane_keyâ
src/shallot.c:307: warning: implicit declaration of function âprint_prkeyâ
src/shallot.c:308: warning: implicit declaration of function âRSA_freeâ
make: *** [all] Error 1
[plate@density shallot-0.0.1]$