All pastes #33231 Raw Edit

MythtvCompile

public text v1 · immutable
#33231 ·published 2005-12-10 21:10 UTC
rendered paste body
g++ -c -pipe -march=pentium3 -Wall -W -O3 -Wall -Wno-switch -fomit-frame-pointer -D_REENTRANT -DPIC -fPIC  -DMMX -Di386 -DUSING_IVTV -DUSING_XRANDR -D_GNU_SOURCE -D_FILE_OFFSET_BITS=64 -DPREFIX=\"/usr/local\" -DUSING_OSS -DUSE_ALSA -DUSE_JOYSTICK_MENU -DQT_NO_DEBUG -DQT_THREAD_SUPPORT -I/usr/share/qt/mkspecs/default -I. -I/usr/local/include -I../libmythsamplerate -I../libmythsoundtouch -I../.. -I/include -o dialogbox.o dialogbox.cpp
dialogbox.cpp:4:21: qlayout.h: No such file or directory
dialogbox.cpp:5:25: qpushbutton.h: No such file or directory
dialogbox.cpp:6:26: qbuttongroup.h: No such file or directory
dialogbox.cpp:7:20: qlabel.h: No such file or directory
dialogbox.cpp:8:21: qcursor.h: No such file or directory
dialogbox.cpp:9:26: qapplication.h: No such file or directory
In file included from dialogbox.cpp:11:
dialogbox.h:4:23: qcheckbox.h: No such file or directory
In file included from dialogbox.h:6,
                 from dialogbox.cpp:11:
mythdialogs.h:4:21: qwidget.h: No such file or directory
mythdialogs.h:5:21: qdialog.h: No such file or directory
mythdialogs.h:6:26: qprogressbar.h: No such file or directory
mythdialogs.h:7:18: qdom.h: No such file or directory
mythdialogs.h:8:22: qptrlist.h: No such file or directory
mythdialogs.h:9:21: qpixmap.h: No such file or directory
mythdialogs.h:11:20: qevent.h: No such file or directory
mythdialogs.h:12:26: qvaluevector.h: No such file or directory
mythdialogs.h:13:25: qscrollview.h: No such file or directory
In file included from mythdialogs.h:18,
                 from dialogbox.h:6,
                 from dialogbox.cpp:11:
uitypes.h:4:21: qobject.h: No such file or directory
uitypes.h:5:21: qstring.h: No such file or directory
uitypes.h:6:21: qregexp.h: No such file or directory
uitypes.h:7:25: qstringlist.h: No such file or directory
uitypes.h:8:19: qrect.h: No such file or directory
uitypes.h:9:19: qfile.h: No such file or directory
uitypes.h:10:18: qmap.h: No such file or directory
uitypes.h:13:19: qfont.h: No such file or directory
uitypes.h:15:22: qpainter.h: No such file or directory
In file included from uitypes.h:18,
                 from mythdialogs.h:18,
                 from dialogbox.h:6,
                 from dialogbox.cpp:11:
mythwidgets.h:4:21: qbutton.h: No such file or directory
mythwidgets.h:5:23: qcombobox.h: No such file or directory
mythwidgets.h:6:22: qspinbox.h: No such file or directory
mythwidgets.h:7:21: qslider.h: No such file or directory
mythwidgets.h:8:23: qlineedit.h: No such file or directory
mythwidgets.h:9:23: qtextedit.h: No such file or directory
mythwidgets.h:11:25: qtoolbutton.h: No such file or directory
mythwidgets.h:13:23: qlistview.h: No such file or directory
mythwidgets.h:14:21: qheader.h: No such file or directory
mythwidgets.h:15:20: qtable.h: No such file or directory
mythwidgets.h:17:22: qlistbox.h: No such file or directory
mythwidgets.h:19:26: qradiobutton.h: No such file or directory
mythwidgets.h:20:20: qimage.h: No such file or directory
mythwidgets.h:22:20: qtimer.h: No such file or directory
In file included from uitypes.h:18,
                 from mythdialogs.h:18,
                 from dialogbox.h:6,
                 from dialogbox.cpp:11:
mythwidgets.h:35: error: expected class-name before '{' token
mythwidgets.h:37: error: ISO C++ forbids declaration of `Q_OBJECT' with no type
mythwidgets.h:37: error: expected `;' before "public"
mythwidgets.h:41: error: `QString' has not been declared
mythwidgets.h:41: error: ISO C++ forbids declaration of `help' with no type
mythwidgets.h:46: error: expected primary-expression before "void"
mythwidgets.h:46: error: ISO C++ forbids declaration of `signals' with no type
mythwidgets.h:46: error: expected `;' before "void"
mythwidgets.h:50: error: expected `:' before "slots"
mythwidgets.h:51: error: expected primary-expression before "void"
mythwidgets.h:51: error: ISO C++ forbids declaration of `slots' with no type
mythwidgets.h:51: error: expected `;' before "void"
mythwidgets.h:56: error: `QKeyEvent' has not been declared
mythwidgets.h:56: error: ISO C++ forbids declaration of `e' with no type
mythwidgets.h:57: error: `QFocusEvent' has not been declared
mythwidgets.h:57: error: ISO C++ forbids declaration of `e' with no type
mythwidgets.h:58: error: `QFocusEvent' has not been declared
mythwidgets.h:58: error: ISO C++ forbids declaration of `e' with no type
mythwidgets.h:61: error: `QString' does not name a type
mythwidgets.h: In member function `void MythComboBox::setHelpText(int)':
mythwidgets.h:41: error: `helptext' undeclared (first use this function)
mythwidgets.h:41: error: (Each undeclared identifier is reported only once for each function it appears in.)
mythwidgets.h: At global scope:
mythwidgets.h:67: error: expected class-name before '{' token
mythwidgets.h:69: error: ISO C++ forbids declaration of `Q_OBJECT' with no type

[SNIP. A BIG ONE TOO. Several thousand lines of errors....]

dialogbox.h:9: error: forward declaration of `struct QButtonGroup'
dialogbox.cpp:49: error: `checkbox' undeclared (first use this function)
dialogbox.cpp:49: error: invalid use of undefined type `struct QButtonGroup'
dialogbox.h:9: error: forward declaration of `struct QButtonGroup'
dialogbox.cpp:51: error: 'class MythPushButton' has no member named 'setFocus'
dialogbox.cpp:54: error: invalid use of undefined type `struct QButtonGroup'
dialogbox.h:9: error: forward declaration of `struct QButtonGroup'
dialogbox.cpp:56: error: invalid use of undefined type `struct QVBoxLayout'
dialogbox.h:8: error: forward declaration of `struct QVBoxLayout'
dialogbox.cpp: At global scope:
dialogbox.cpp:60: error: no `void DialogBox::buttonPressed(int)' member function declared in class `DialogBox'
dialogbox.cpp: In member function `void DialogBox::buttonPressed(int)':
dialogbox.cpp:61: error: invalid use of undefined type `struct QButtonGroup'
dialogbox.h:9: error: forward declaration of `struct QButtonGroup'
dialogbox.cpp:61: error: `checkbox' undeclared (first use this function)
make[2]: *** [dialogbox.o] Error 1
make[2]: Leaving directory `/root/temp/ports/mythtv/mythtv-0.18.1/libs/libmyth'
make[1]: *** [sub-libmyth] Error 2
make[1]: Leaving directory `/root/temp/ports/mythtv/mythtv-0.18.1/libs'
make: *** [sub-libs] Error 2