All pastes #33136 Raw Edit

Untitled

public text v1 · immutable
#33136 ·published 2005-12-09 23:38 UTC
rendered paste body
>>> emerge (1 of 1) dev-perl/DBD-mysql-3.0002_p4 to /
>>> md5 files   ;-) DBD-mysql-2.9007.ebuild
>>> md5 files   ;-) DBD-mysql-3.0002_p3.ebuild
>>> md5 files   ;-) DBD-mysql-2.1027.ebuild
>>> md5 files   ;-) DBD-mysql-2.9003.ebuild
>>> md5 files   ;-) DBD-mysql-3.0002_p4.ebuild
>>> md5 files   ;-) files/digest-DBD-mysql-2.1027
>>> md5 files   ;-) files/digest-DBD-mysql-2.9003
>>> md5 files   ;-) files/digest-DBD-mysql-2.9007
>>> md5 files   ;-) files/makemaker.patch
>>> md5 files   ;-) files/digest-DBD-mysql-3.0002_p3
>>> md5 files   ;-) files/digest-DBD-mysql-3.0002_p4
>>> md5 src_uri ;-) DBD-mysql-3.0002_4.tar.gz
>>> Unpacking source...
>>> Unpacking DBD-mysql-3.0002_4.tar.gz to /var/tmp/portage/DBD-mysql-3.0002_p4/work
>>> Source unpacked.
 * Using ExtUtils::MakeMaker
I will use the following settings for compiling and testing:

  cflags        (mysql_config) = -I/usr/include/mysql -march=pentium3 -fforce-addr -momit-leaf-frame-pointer -fomit-frame-pointer -ftracer -pipe -DHAVE_ERRNO_AS_DEFINE=1
  embedded      (mysql_config) =
  libs          (mysql_config) = -L/usr/lib/mysql -lmysqlclient -L/usr/lib -lz -lcrypt -lnsl -lm -L/usr/lib -lssl -lcrypto
  mysql_config  (guessed     ) = mysql_config
  nocatchstderr (default     ) = 0
  nofoundrows   (default     ) = 0
  ps-protocol   (default     ) = 1
  ssl           (guessed     ) = 1
  testdb        (default     ) = test
  testhost      (default     ) =
  testpassword  (default     ) =
  testsocket    (default     ) =
  testuser      (default     ) =

To change these settings, see 'perl Makefile.PL --help' and
'perldoc INSTALL'.

Checking if your kit is complete...
Looks good
Using DBI 1.48 (for perl 5.008007 on i686-linux-thread-multi) installed in /usr/lib/perl5/vendor_perl/5.8.7/i686-linux-thread-multi/auto/DBI/
Writing Makefile for DBD::mysql
cp lib/DBD/mysql.pm blib/lib/DBD/mysql.pm
cp lib/DBD/mysql/GetInfo.pm blib/lib/DBD/mysql/GetInfo.pm
cp lib/Mysql.pm blib/lib/Mysql.pm
cp lib/DBD/mysql/INSTALL.pod blib/lib/DBD/mysql/INSTALL.pod
cp lib/Mysql/Statement.pm blib/lib/Mysql/Statement.pm
cp lib/Bundle/DBD/mysql.pm blib/lib/Bundle/DBD/mysql.pm
i686-pc-linux-gnu-gcc -c  -I/usr/lib/perl5/vendor_perl/5.8.7/i686-linux-thread-multi/auto/DBI/ -I/usr/include/mysql -march=pentium3 -fforce-addr -momit-leaf-frame-pointer -fomit-frame-pointer -ftracer -pipe -DHAVE_ERRNO_AS_DEFINE=1 -DDBD_MYSQL_WITH_SSL -DDBD_MYSQL_INSERT_ID_IS_GOOD -g  -D_REENTRANT -D_GNU_SOURCE -DTHREADS_HAVE_PIDS -fno-strict-aliasing -pipe -D_LARGEFILE_SOURCE -D_FILE_OFFSET_BITS=64 -O3 -march=pentium3 -fforce-addr -momit-leaf-frame-pointer -fomit-frame-pointer -ftracer -pipe   -DVERSION=\"3.0002_4\" -DXS_VERSION=\"3.0002_4\" -fPIC "-I/usr/lib/perl5/5.8.7/i686-linux-thread-multi/CORE"   dbdimp.c
dbdimp.c: In function `mysql_to_perl_type':
dbdimp.c:249: error: `MYSQL_TYPE_BIT' undeclared (first use in this function)
dbdimp.c:249: error: (Each undeclared identifier is reported only once
dbdimp.c:249: error: for each function it appears in.)
dbdimp.c:259: error: `MYSQL_TYPE_VARCHAR' undeclared (first use in this function)
dbdimp.c:263:25: warning: extra tokens at end of #ifdef directive
make: *** [dbdimp.o] Error 1

!!! ERROR: dev-perl/DBD-mysql-3.0002_p4 failed.
!!! Function perl-module_src_compile, Line 120, Exitcode 2
!!! compilation failed
!!! If you need support, post the topmost build error, NOT this status message.