All pastes #33122 Raw Edit

amarokproblem

public text v1 · immutable
#33122 ·published 2005-12-09 21:18 UTC
rendered paste body
ONFIG_H -I. -I. -I../../.. -I../../../amarok/src/plugin -I../../../amarok/src -I/usr/kde/
3.4/include -I/usr/qt/3/include -I.   -DQT_THREAD_SUPPORT  -D_REENTRANT  -Wno-long-long -
Wundef -ansi -D_XOPEN_SOURCE=500 -D_BSD_SOURCE -Wcast-align -Wconversion -Wchar-subscript
s -Wall -W -Wpointer-arith -DNDEBUG -DNO_DEBUG -O2 -march=pentium3 -O3 -pipe -Wformat-sec
urity -Wmissing-format-attribute -Wno-non-virtual-dtor -fno-exceptions -fno-check-new -fn
o-common -DQT_CLEAN_NAMESPACE -DQT_NO_ASCII_CAST -DQT_NO_STL -DQT_NO_COMPAT -DQT_NO_TRANS
LATION  -c -o enginebase.lo enginebase.cpp
/bin/sh ../../../libtool --silent --tag=CXX --mode=link i686-pc-linux-gnu-g++  -Wno-long-
long -Wundef -ansi -D_XOPEN_SOURCE=500 -D_BSD_SOURCE -Wcast-align -Wconversion -Wchar-sub
scripts -Wall -W -Wpointer-arith -DNDEBUG -DNO_DEBUG -O2 -march=pentium3 -O3 -pipe -Wform
at-security -Wmissing-format-attribute -Wno-non-virtual-dtor -fno-exceptions -fno-check-n
ew -fno-common -DQT_CLEAN_NAMESPACE -DQT_NO_ASCII_CAST -DQT_NO_STL -DQT_NO_COMPAT -DQT_NO
_TRANSLATION    -o libengine.la   enginebase.lo  
make[5]: Leaving directory `/var/tmp/portage/amarok-1.3.6/work/amarok-1.3.6/amarok/src/en
gine'
Making all in void
make[5]: Entering directory `/var/tmp/portage/amarok-1.3.6/work/amarok-1.3.6/amarok/src/e
ngine/void'
/bin/sh ../../../../libtool --silent --tag=CXX --mode=compile i686-pc-linux-gnu-g++ -DHAV
E_CONFIG_H -I. -I. -I../../../.. -I../../../../amarok/src/engine -I../../../../amarok/src
/plugin -I../../../../amarok/src -I/usr/kde/3.4/include -I/usr/qt/3/include -I.   -DQT_TH
READ_SUPPORT  -D_REENTRANT  -Wno-long-long -Wundef -ansi -D_XOPEN_SOURCE=500 -D_BSD_SOURC
E -Wcast-align -Wconversion -Wchar-subscripts -Wall -W -Wpointer-arith -DNDEBUG -DNO_DEBU
G -O2 -march=pentium3 -O3 -pipe -Wformat-security -Wmissing-format-attribute -Wno-non-vir
tual-dtor -fno-exceptions -fno-check-new -fno-common -DQT_CLEAN_NAMESPACE -DQT_NO_ASCII_C
AST -DQT_NO_STL -DQT_NO_COMPAT -DQT_NO_TRANSLATION  -c -o void-engine.lo void-engine.cpp
/bin/sh ../../../../libtool --silent --tag=CXX --mode=link i686-pc-linux-gnu-g++  -Wno-lo
ng-long -Wundef -ansi -D_XOPEN_SOURCE=500 -D_BSD_SOURCE -Wcast-align -Wconversion -Wchar-
subscripts -Wall -W -Wpointer-arith -DNDEBUG -DNO_DEBUG -O2 -march=pentium3 -O3 -pipe -Wf
ormat-security -Wmissing-format-attribute -Wno-non-virtual-dtor -fno-exceptions -fno-chec
k-new -fno-common -DQT_CLEAN_NAMESPACE -DQT_NO_ASCII_CAST -DQT_NO_STL -DQT_NO_COMPAT -DQT
_NO_TRANSLATION    -o libamarok_void-engine_plugin.la -rpath /usr/kde/3.4/lib/kde3 -avoid
-version -module -no-undefined -Wl,--no-undefined -Wl,--allow-shlib-undefined -R /usr/kde
/3.4/lib -R /usr/kde/3.4/lib -R /usr/qt/3/lib -R /usr/lib  -L/usr/kde/3.4/lib -L/usr/qt/3
/lib -L/usr/lib    void-engine.lo ../../../../amarok/src/engine/libengine.la ../../../../
amarok/src/plugin/libplugin.la -lkdecore 
grep: //usr/lib/gcc-lib/i686-pc-linux-gnu/3.3.5/libstdc++.la: No such file or directory
/bin/sed: can't read //usr/lib/gcc-lib/i686-pc-linux-gnu/3.3.5/libstdc++.la: No such file
 or directory
libtool: link: `//usr/lib/gcc-lib/i686-pc-linux-gnu/3.3.5/libstdc++.la' is not a valid li
btool archive
make[5]: *** [libamarok_void-engine_plugin.la] Error 1
make[5]: Leaving directory `/var/tmp/portage/amarok-1.3.6/work/amarok-1.3.6/amarok/src/en
gine/void'
make[4]: *** [all-recursive] Error 1
make[4]: Leaving directory `/var/tmp/portage/amarok-1.3.6/work/amarok-1.3.6/amarok/src/en
gine'
make[3]: *** [all-recursive] Error 1
make[3]: Leaving directory `/var/tmp/portage/amarok-1.3.6/work/amarok-1.3.6/amarok/src'
make[2]: *** [all-recursive] Error 1
make[2]: Leaving directory `/var/tmp/portage/amarok-1.3.6/work/amarok-1.3.6/amarok'
make[1]: *** [all-recursive] Error 1
make[1]: Leaving directory `/var/tmp/portage/amarok-1.3.6/work/amarok-1.3.6'
make: *** [all] Error 2

!!! ERROR: media-sound/amarok-1.3.6 failed.
!!! Function kde_src_compile, Line 173, Exitcode 2
!!! died running emake, kde_src_compile:make
!!! If you need support, post the topmost build error, NOT this status message.