All pastes #330753 Raw Edit

Anonymous

public text v1 · immutable
#330753 ·published 2007-01-28 06:05 UTC
rendered paste body
  [32;01m* [0m Determining the location of the kernel source code
  [32;01m* [0m Found kernel source directory:
  [32;01m* [0m     /usr/src/linux
  [32;01m* [0m Found sources for kernel version:
  [32;01m* [0m     2.6.20-rc6-gentoo
  [32;01m* [0m X11 implementation is xorg-x11.
>>> Unpacking source...
  [32;01m* [0m Unpacking Ati drivers ...
 [A [72C   [34;01m[  [32;01mok [34;01m ] [0m
  [32;01m* [0m Applying ati-powermode.sh.patch ...
 [A [72C   [34;01m[  [32;01mok [34;01m ] [0m
>>> Source unpacked.
>>> Compiling source in /var/tmp/portage/x11-drivers/ati-drivers-8.33.6-r90/work/common/lib/modules/fglrx/build_mod ...
  [32;01m* [0m Building the DRM module...
  [32;01m* [0m Converting Makefile to use M= instead of SUBDIRS= ...
 [A [72C   [34;01m[  [32;01mok [34;01m ] [0m
  [32;01m* [0m Preparing fglrx module
/var/tmp/portage/x11-drivers/ati-drivers-8.33.6-r90/work/common/lib/modules/fglrx/build_mod/firegl_public.c:198: error: expected declaration specifiers or ‘...’ before ‘mlock’
/var/tmp/portage/x11-drivers/ati-drivers-8.33.6-r90/work/common/lib/modules/fglrx/build_mod/firegl_public.c:198: error: expected declaration specifiers or ‘...’ before ‘addr’
/var/tmp/portage/x11-drivers/ati-drivers-8.33.6-r90/work/common/lib/modules/fglrx/build_mod/firegl_public.c:198: error: expected declaration specifiers or ‘...’ before ‘len’
/var/tmp/portage/x11-drivers/ati-drivers-8.33.6-r90/work/common/lib/modules/fglrx/build_mod/firegl_public.c:200: warning: return type defaults to ‘int’
/var/tmp/portage/x11-drivers/ati-drivers-8.33.6-r90/work/common/lib/modules/fglrx/build_mod/firegl_public.c: In function ‘_syscall2’:
/var/tmp/portage/x11-drivers/ati-drivers-8.33.6-r90/work/common/lib/modules/fglrx/build_mod/firegl_public.c:200: error: expected declaration specifiers before ‘_syscall2’
/var/tmp/portage/x11-drivers/ati-drivers-8.33.6-r90/work/common/lib/modules/fglrx/build_mod/firegl_public.c:233: error: parameter ‘__ke_debuglevel’ is initialized
/var/tmp/portage/x11-drivers/ati-drivers-8.33.6-r90/work/common/lib/modules/fglrx/build_mod/firegl_public.c:234: error: parameter ‘__ke_moduleflags’ is initialized
/var/tmp/portage/x11-drivers/ati-drivers-8.33.6-r90/work/common/lib/modules/fglrx/build_mod/firegl_public.c:237: error: storage class specified for parameter ‘__mod_author237’
/var/tmp/portage/x11-drivers/ati-drivers-8.33.6-r90/work/common/lib/modules/fglrx/build_mod/firegl_public.c:237: error: parameter ‘__mod_author237’ is initialized
/var/tmp/portage/x11-drivers/ati-drivers-8.33.6-r90/work/common/lib/modules/fglrx/build_mod/firegl_public.c:237: warning: ‘__used__’ attribute ignored
/var/tmp/portage/x11-drivers/ati-drivers-8.33.6-r90/work/common/lib/modules/fglrx/build_mod/firegl_public.c:237: error: section attribute not allowed for ‘__mod_author237’
/var/tmp/portage/x11-drivers/ati-drivers-8.33.6-r90/work/common/lib/modules/fglrx/build_mod/firegl_public.c:238: error: storage class specified for parameter ‘__mod_description238’
/var/tmp/portage/x11-drivers/ati-drivers-8.33.6-r90/work/common/lib/modules/fglrx/build_mod/firegl_public.c:238: error: parameter ‘__mod_description238’ is initialized
/var/tmp/portage/x11-drivers/ati-drivers-8.33.6-r90/work/common/lib/modules/fglrx/build_mod/firegl_public.c:238: warning: ‘__used__’ attribute ignored
/var/tmp/portage/x11-drivers/ati-drivers-8.33.6-r90/work/common/lib/modules/fglrx/build_mod/firegl_public.c:238: error: section attribute not allowed for ‘__mod_description238’
/var/tmp/portage/x11-drivers/ati-drivers-8.33.6-r90/work/common/lib/modules/fglrx/build_mod/firegl_public.c:242: error: expected ‘=’, ‘,’, ‘;’, ‘asm’ or ‘__attribute__’ before ‘{’ token
/var/tmp/portage/x11-drivers/ati-drivers-8.33.6-r90/work/common/lib/modules/fglrx/build_mod/firegl_public.c:242: error: expected declaration specifiers before ‘;’ token
/var/tmp/portage/x11-drivers/ati-drivers-8.33.6-r90/work/common/lib/modules/fglrx/build_mod/firegl_public.c:242: error: storage class specified for parameter ‘__param_perm_check_firegl’
/var/tmp/portage/x11-drivers/ati-drivers-8.33.6-r90/work/common/lib/modules/fglrx/build_mod/firegl_public.c:242: error: parameter ‘__param_perm_check_firegl’ is initialized
/var/tmp/portage/x11-drivers/ati-drivers-8.33.6-r90/work/common/lib/modules/fglrx/build_mod/firegl_public.c:242: error: storage class specified for parameter ‘__param_str_firegl’
/var/tmp/portage/x11-drivers/ati-drivers-8.33.6-r90/work/common/lib/modules/fglrx/build_mod/firegl_public.c:242: error: parameter ‘__param_str_firegl’ is initialized
/var/tmp/portage/x11-drivers/ati-drivers-8.33.6-r90/work/common/lib/modules/fglrx/build_mod/firegl_public.c:242: error: storage class specified for parameter ‘__param_firegl’
/var/tmp/portage/x11-drivers/ati-drivers-8.33.6-r90/work/common/lib/modules/fglrx/build_mod/firegl_public.c:242: error: parameter ‘__param_firegl’ is initialized
/var/tmp/portage/x11-drivers/ati-drivers-8.33.6-r90/work/common/lib/modules/fglrx/build_mod/firegl_public.c:242: warning: ‘__used__’ attribute ignored
/var/tmp/portage/x11-drivers/ati-drivers-8.33.6-r90/work/common/lib/modules/fglrx/build_mod/firegl_public.c:242: error: section attribute not allowed for ‘__param_firegl’
/var/tmp/portage/x11-drivers/ati-drivers-8.33.6-r90/work/common/lib/modules/fglrx/build_mod/firegl_public.c:242: error: alignment may not be specified for ‘__param_firegl’
/var/tmp/portage/x11-drivers/ati-drivers-8.33.6-r90/work/common/lib/modules/fglrx/build_mod/firegl_public.c:242: error: ‘firegl’ undeclared (first use in this function)
/var/tmp/portage/x11-drivers/ati-drivers-8.33.6-r90/work/common/lib/modules/fglrx/build_mod/firegl_public.c:242: error: (Each undeclared identifier is reported only once
/var/tmp/portage/x11-drivers/ati-drivers-8.33.6-r90/work/common/lib/modules/fglrx/build_mod/firegl_public.c:242: error: for each function it appears in.)
/var/tmp/portage/x11-drivers/ati-drivers-8.33.6-r90/work/common/lib/modules/fglrx/build_mod/firegl_public.c:242: error: storage class specified for parameter ‘__mod_firegltype242’
/var/tmp/portage/x11-drivers/ati-drivers-8.33.6-r90/work/common/lib/modules/fglrx/build_mod/firegl_public.c:242: error: parameter ‘__mod_firegltype242’ is initialized
/var/tmp/portage/x11-drivers/ati-drivers-8.33.6-r90/work/common/lib/modules/fglrx/build_mod/firegl_public.c:242: warning: ‘__used__’ attribute ignored
/var/tmp/portage/x11-drivers/ati-drivers-8.33.6-r90/work/common/lib/modules/fglrx/build_mod/firegl_public.c:242: error: section attribute not allowed for ‘__mod_firegltype242’
/var/tmp/portage/x11-drivers/ati-drivers-8.33.6-r90/work/common/lib/modules/fglrx/build_mod/firegl_public.c:245: error: storage class specified for parameter ‘__mod_license245’
/var/tmp/portage/x11-drivers/ati-drivers-8.33.6-r90/work/common/lib/modules/fglrx/build_mod/firegl_public.c:245: error: parameter ‘__mod_license245’ is initialized
/var/tmp/portage/x11-drivers/ati-drivers-8.33.6-r90/work/common/lib/modules/fglrx/build_mod/firegl_public.c:245: warning: ‘__used__’ attribute ignored
/var/tmp/portage/x11-drivers/ati-drivers-8.33.6-r90/work/common/lib/modules/fglrx/build_mod/firegl_public.c:245: error: section attribute not allowed for ‘__mod_license245’
/var/tmp/portage/x11-drivers/ati-drivers-8.33.6-r90/work/common/lib/modules/fglrx/build_mod/firegl_public.c:251: error: parameter ‘__ke_UTS_RELEASE’ is initialized
/var/tmp/portage/x11-drivers/ati-drivers-8.33.6-r90/work/common/lib/modules/fglrx/build_mod/firegl_public.c:252: error: parameter ‘__ke_PAGE_SHIFT’ is initialized
/var/tmp/portage/x11-drivers/ati-drivers-8.33.6-r90/work/common/lib/modules/fglrx/build_mod/firegl_public.c:253: error: parameter ‘__ke_PAGE_SIZE’ is initialized
/var/tmp/portage/x11-drivers/ati-drivers-8.33.6-r90/work/common/lib/modules/fglrx/build_mod/firegl_public.c:254: error: parameter ‘__ke_PAGE_MASK’ is initialized
/var/tmp/portage/x11-drivers/ati-drivers-8.33.6-r90/work/common/lib/modules/fglrx/build_mod/firegl_public.c:255: error: parameter ‘__ke_LINUX_VERSION_CODE’ is initialized
/var/tmp/portage/x11-drivers/ati-drivers-8.33.6-r90/work/common/lib/modules/fglrx/build_mod/firegl_public.c:262: error: parameter ‘__ke_MODVERSIONS_State’ is initialized
/var/tmp/portage/x11-drivers/ati-drivers-8.33.6-r90/work/common/lib/modules/fglrx/build_mod/firegl_public.c:270: error: parameter ‘__ke_SMP_State’ is initialized
/var/tmp/portage/x11-drivers/ati-drivers-8.33.6-r90/work/common/lib/modules/fglrx/build_mod/firegl_public.c:276: error: parameter ‘__ke_PAE_State’ is initialized
/var/tmp/portage/x11-drivers/ati-drivers-8.33.6-r90/work/common/lib/modules/fglrx/build_mod/firegl_public.c:287: error: expected ‘=’, ‘,’, ‘;’, ‘asm’ or ‘__attribute__’ before ‘{’ token
/var/tmp/portage/x11-drivers/ati-drivers-8.33.6-r90/work/common/lib/modules/fglrx/build_mod/firegl_public.c:289: error: expected ‘=’, ‘,’, ‘;’, ‘asm’ or ‘__attribute__’ before ‘{’ token
/var/tmp/portage/x11-drivers/ati-drivers-8.33.6-r90/work/common/lib/modules/fglrx/build_mod/firegl_public.c:291: error: expected ‘=’, ‘,’, ‘;’, ‘asm’ or ‘__attribute__’ before ‘{’ token
/var/tmp/portage/x11-drivers/ati-drivers-8.33.6-r90/work/common/lib/modules/fglrx/build_mod/firegl_public.c:293: error: expected ‘=’, ‘,’, ‘;’, ‘asm’ or ‘__attribute__’ before ‘{’ token
/var/tmp/portage/x11-drivers/ati-drivers-8.33.6-r90/work/common/lib/modules/fglrx/build_mod/firegl_public.c:300: error: storage class specified for parameter ‘firegl_fops’
/var/tmp/portage/x11-drivers/ati-drivers-8.33.6-r90/work/common/lib/modules/fglrx/build_mod/firegl_public.c:300: error: parameter ‘firegl_fops’ is initialized
/var/tmp/portage/x11-drivers/ati-drivers-8.33.6-r90/work/common/lib/modules/fglrx/build_mod/firegl_public.c:305: error: ‘ip_firegl_open’ undeclared (first use in this function)
/var/tmp/portage/x11-drivers/ati-drivers-8.33.6-r90/work/common/lib/modules/fglrx/build_mod/firegl_public.c:306: error: ‘ip_firegl_release’ undeclared (first use in this function)
/var/tmp/portage/x11-drivers/ati-drivers-8.33.6-r90/work/common/lib/modules/fglrx/build_mod/firegl_public.c:307: error: ‘ip_firegl_ioctl’ undeclared (first use in this function)
/var/tmp/portage/x11-drivers/ati-drivers-8.33.6-r90/work/common/lib/modules/fglrx/build_mod/firegl_public.c:308: error: ‘ip_firegl_mmap’ undeclared (first use in this function)
/var/tmp/portage/x11-drivers/ati-drivers-8.33.6-r90/work/common/lib/modules/fglrx/build_mod/firegl_public.c:323: error: storage class specified for parameter ‘device_t’
/var/tmp/portage/x11-drivers/ati-drivers-8.33.6-r90/work/common/lib/modules/fglrx/build_mod/firegl_public.c:325: error: expected ‘=’, ‘,’, ‘;’, ‘asm’ or ‘__attribute__’ before ‘firegl_public_device’
In file included from /var/tmp/portage/x11-drivers/ati-drivers-8.33.6-r90/work/common/lib/modules/fglrx/build_mod/firegl_public.c:331:
/var/tmp/portage/x11-drivers/ati-drivers-8.33.6-r90/work/common/lib/modules/fglrx/build_mod/drm.h:104: error: storage class specified for parameter ‘drm_handle_t’
/var/tmp/portage/x11-drivers/ati-drivers-8.33.6-r90/work/common/lib/modules/fglrx/build_mod/drm.h:105: error: storage class specified for parameter ‘drm_context_t’
/var/tmp/portage/x11-drivers/ati-drivers-8.33.6-r90/work/common/lib/modules/fglrx/build_mod/drm.h:106: error: storage class specified for parameter ‘drm_drawable_t’
/var/tmp/portage/x11-drivers/ati-drivers-8.33.6-r90/work/common/lib/modules/fglrx/build_mod/drm.h:107: error: storage class specified for parameter ‘drm_magic_t’
/var/tmp/portage/x11-drivers/ati-drivers-8.33.6-r90/work/common/lib/modules/fglrx/build_mod/drm.h:124: error: storage class specified for parameter ‘drm_clip_rect_t’
/var/tmp/portage/x11-drivers/ati-drivers-8.33.6-r90/work/common/lib/modules/fglrx/build_mod/drm.h:136: error: storage class specified for parameter ‘drm_tex_region_t’
/var/tmp/portage/x11-drivers/ati-drivers-8.33.6-r90/work/common/lib/modules/fglrx/build_mod/drm.h:148: error: storage class specified for parameter ‘drm_hw_lock_t’
/var/tmp/portage/x11-drivers/ati-drivers-8.33.6-r90/work/common/lib/modules/fglrx/build_mod/drm.h:182: error: storage class specified for parameter ‘drm_version_t’
/var/tmp/portage/x11-drivers/ati-drivers-8.33.6-r90/work/common/lib/modules/fglrx/build_mod/drm.h:193: error: storage class specified for parameter ‘drm_unique_t’
/var/tmp/portage/x11-drivers/ati-drivers-8.33.6-r90/work/common/lib/modules/fglrx/build_mod/drm.h:199: error: expected specifier-qualifier-list before ‘drm_version_t’
/var/tmp/portage/x11-drivers/ati-drivers-8.33.6-r90/work/common/lib/modules/fglrx/build_mod/drm.h:200: error: storage class specified for parameter ‘drm_list_t’
/var/tmp/portage/x11-drivers/ati-drivers-8.33.6-r90/work/common/lib/modules/fglrx/build_mod/drm.h:205: error: storage class specified for parameter ‘drm_block_t’
/var/tmp/portage/x11-drivers/ati-drivers-8.33.6-r90/work/common/lib/modules/fglrx/build_mod/drm.h:221: error: storage class specified for parameter ‘drm_control_t’
/var/tmp/portage/x11-drivers/ati-drivers-8.33.6-r90/work/common/lib/modules/fglrx/build_mod/drm.h:233: error: storage class specified for parameter ‘drm_map_type_t’
/var/tmp/portage/x11-drivers/ati-drivers-8.33.6-r90/work/common/lib/modules/fglrx/build_mod/drm.h:247: error: storage class specified for parameter ‘drm_map_flags_t’
/var/tmp/portage/x11-drivers/ati-drivers-8.33.6-r90/work/common/lib/modules/fglrx/build_mod/drm.h:253: error: storage class specified for parameter ‘drm_ctx_priv_map_t’
/var/tmp/portage/x11-drivers/ati-drivers-8.33.6-r90/work/common/lib/modules/fglrx/build_mod/drm.h:265: error: expected specifier-qualifier-list before ‘drm_map_type_t’
/var/tmp/portage/x11-drivers/ati-drivers-8.33.6-r90/work/common/lib/modules/fglrx/build_mod/drm.h:271: error: storage class specified for parameter ‘drm_map_t’
/var/tmp/portage/x11-drivers/ati-drivers-8.33.6-r90/work/common/lib/modules/fglrx/build_mod/drm.h:284: error: storage class specified for parameter ‘drm_client_t’
/var/tmp/portage/x11-drivers/ati-drivers-8.33.6-r90/work/common/lib/modules/fglrx/build_mod/drm.h:306: error: storage class specified for parameter ‘drm_stat_type_t’
/var/tmp/portage/x11-drivers/ati-drivers-8.33.6-r90/work/common/lib/modules/fglrx/build_mod/drm.h:316: error: expected specifier-qualifier-list before ‘drm_stat_type_t’
/var/tmp/portage/x11-drivers/ati-drivers-8.33.6-r90/work/common/lib/modules/fglrx/build_mod/drm.h:318: error: storage class specified for parameter ‘drm_stats_t’
/var/tmp/portage/x11-drivers/ati-drivers-8.33.6-r90/work/common/lib/modules/fglrx/build_mod/drm.h:334: error: storage class specified for parameter ‘drm_lock_flags_t’
/var/tmp/portage/x11-drivers/ati-drivers-8.33.6-r90/work/common/lib/modules/fglrx/build_mod/drm.h:344: error: expected specifier-qualifier-list before ‘drm_lock_flags_t’
/var/tmp/portage/x11-drivers/ati-drivers-8.33.6-r90/work/common/lib/modules/fglrx/build_mod/drm.h:345: error: storage class specified for parameter ‘drm_lock_t’
/var/tmp/portage/x11-drivers/ati-drivers-8.33.6-r90/work/common/lib/modules/fglrx/build_mod/drm.h:375: error: storage class specified for parameter ‘drm_dma_flags_t’
/var/tmp/portage/x11-drivers/ati-drivers-8.33.6-r90/work/common/lib/modules/fglrx/build_mod/drm.h:397: error: storage class specified for parameter ‘drm_buf_desc_t’
/var/tmp/portage/x11-drivers/ati-drivers-8.33.6-r90/work/common/lib/modules/fglrx/build_mod/drm.h:405: error: expected specifier-qualifier-list before ‘drm_buf_desc_t’
/var/tmp/portage/x11-drivers/ati-drivers-8.33.6-r90/work/common/lib/modules/fglrx/build_mod/drm.h:406: error: storage class specified for parameter ‘drm_buf_info_t’
/var/tmp/portage/x11-drivers/ati-drivers-8.33.6-r90/work/common/lib/modules/fglrx/build_mod/drm.h:415: error: storage class specified for parameter ‘drm_buf_free_t’
/var/tmp/portage/x11-drivers/ati-drivers-8.33.6-r90/work/common/lib/modules/fglrx/build_mod/drm.h:428: error: storage class specified for parameter ‘drm_buf_pub_t’
/var/tmp/portage/x11-drivers/ati-drivers-8.33.6-r90/work/common/lib/modules/fglrx/build_mod/drm.h:437: error: expected specifier-qualifier-list before ‘drm_buf_pub_t’
/var/tmp/portage/x11-drivers/ati-drivers-8.33.6-r90/work/common/lib/modules/fglrx/build_mod/drm.h:438: error: storage class specified for parameter ‘drm_buf_map_t’
/var/tmp/portage/x11-drivers/ati-drivers-8.33.6-r90/work/common/lib/modules/fglrx/build_mod/drm.h:453: error: expected specifier-qualifier-list before ‘drm_dma_flags_t’
/var/tmp/portage/x11-drivers/ati-drivers-8.33.6-r90/work/common/lib/modules/fglrx/build_mod/drm.h:459: error: storage class specified for parameter ‘drm_dma_t’
/var/tmp/portage/x11-drivers/ati-drivers-8.33.6-r90/work/common/lib/modules/fglrx/build_mod/drm.h:465: error: storage class specified for parameter ‘drm_ctx_flags_t’
/var/tmp/portage/x11-drivers/ati-drivers-8.33.6-r90/work/common/lib/modules/fglrx/build_mod/drm.h:474: error: expected specifier-qualifier-list before ‘drm_context_t’
/var/tmp/portage/x11-drivers/ati-drivers-8.33.6-r90/work/common/lib/modules/fglrx/build_mod/drm.h:476: error: storage class specified for parameter ‘drm_ctx_t’
/var/tmp/portage/x11-drivers/ati-drivers-8.33.6-r90/work/common/lib/modules/fglrx/build_mod/drm.h:484: error: expected specifier-qualifier-list before ‘drm_ctx_t’
/var/tmp/portage/x11-drivers/ati-drivers-8.33.6-r90/work/common/lib/modules/fglrx/build_mod/drm.h:485: error: storage class specified for parameter ‘drm_ctx_res_t’
/var/tmp/portage/x11-drivers/ati-drivers-8.33.6-r90/work/common/lib/modules/fglrx/build_mod/drm.h:492: error: expected specifier-qualifier-list before ‘drm_drawable_t’
/var/tmp/portage/x11-drivers/ati-drivers-8.33.6-r90/work/common/lib/modules/fglrx/build_mod/drm.h:493: error: storage class specified for parameter ‘drm_draw_t’
/var/tmp/portage/x11-drivers/ati-drivers-8.33.6-r90/work/common/lib/modules/fglrx/build_mod/drm.h:500: error: expected specifier-qualifier-list before ‘drm_magic_t’
/var/tmp/portage/x11-drivers/ati-drivers-8.33.6-r90/work/common/lib/modules/fglrx/build_mod/drm.h:501: error: storage class specified for parameter ‘drm_auth_t’
/var/tmp/portage/x11-drivers/ati-drivers-8.33.6-r90/work/common/lib/modules/fglrx/build_mod/drm.h:514: error: storage class specified for parameter ‘drm_irq_busid_t’
/var/tmp/portage/x11-drivers/ati-drivers-8.33.6-r90/work/common/lib/modules/fglrx/build_mod/drm.h:521: error: storage class specified for parameter ‘drm_vblank_seq_type_t’
/var/tmp/portage/x11-drivers/ati-drivers-8.33.6-r90/work/common/lib/modules/fglrx/build_mod/drm.h:528: error: expected specifier-qualifier-list before ‘drm_vblank_seq_type_t’
/var/tmp/portage/x11-drivers/ati-drivers-8.33.6-r90/work/common/lib/modules/fglrx/build_mod/drm.h:531: warning: empty declaration
/var/tmp/portage/x11-drivers/ati-drivers-8.33.6-r90/work/common/lib/modules/fglrx/build_mod/drm.h:535: error: expected specifier-qualifier-list before ‘drm_vblank_seq_type_t’
/var/tmp/portage/x11-drivers/ati-drivers-8.33.6-r90/work/common/lib/modules/fglrx/build_mod/drm.h:539: warning: empty declaration
/var/tmp/portage/x11-drivers/ati-drivers-8.33.6-r90/work/common/lib/modules/fglrx/build_mod/drm.h:550: error: storage class specified for parameter ‘drm_wait_vblank_t’
/var/tmp/portage/x11-drivers/ati-drivers-8.33.6-r90/work/common/lib/modules/fglrx/build_mod/drm.h:560: error: storage class specified for parameter ‘drm_agp_mode_t’
/var/tmp/portage/x11-drivers/ati-drivers-8.33.6-r90/work/common/lib/modules/fglrx/build_mod/drm.h:573: error: storage class specified for parameter ‘drm_agp_buffer_t’
/var/tmp/portage/x11-drivers/ati-drivers-8.33.6-r90/work/common/lib/modules/fglrx/build_mod/drm.h:584: error: storage class specified for parameter ‘drm_agp_binding_t’
/var/tmp/portage/x11-drivers/ati-drivers-8.33.6-r90/work/common/lib/modules/fglrx/build_mod/drm.h:606: error: storage class specified for parameter ‘drm_agp_info_t’
/var/tmp/portage/x11-drivers/ati-drivers-8.33.6-r90/work/common/lib/modules/fglrx/build_mod/drm.h:615: error: storage class specified for parameter ‘drm_scatter_gather_t’
/var/tmp/portage/x11-drivers/ati-drivers-8.33.6-r90/work/common/lib/modules/fglrx/build_mod/drm.h:625: error: storage class specified for parameter ‘drm_set_version_t’
/var/tmp/portage/x11-drivers/ati-drivers-8.33.6-r90/work/common/lib/modules/fglrx/build_mod/firegl_public.c:337: error: expected ‘=’, ‘,’, ‘;’, ‘asm’ or ‘__attribute__’ before ‘{’ token
In file included from include/linux/poll.h:4,
                 from /var/tmp/portage/x11-drivers/ati-drivers-8.33.6-r90/work/common/lib/modules/fglrx/build_mod/drmP.h:82,
                 from /var/tmp/portage/x11-drivers/ati-drivers-8.33.6-r90/work/common/lib/modules/fglrx/build_mod/drm_proc.h:41,
                 from /var/tmp/portage/x11-drivers/ati-drivers-8.33.6-r90/work/common/lib/modules/fglrx/build_mod/firegl_public.c:347:
include/asm/poll.h:25: warning: empty declaration
In file included from /var/tmp/portage/x11-drivers/ati-drivers-8.33.6-r90/work/common/lib/modules/fglrx/build_mod/drmP.h:82,
                 from /var/tmp/portage/x11-drivers/ati-drivers-8.33.6-r90/work/common/lib/modules/fglrx/build_mod/drm_proc.h:41,
                 from /var/tmp/portage/x11-drivers/ati-drivers-8.33.6-r90/work/common/lib/modules/fglrx/build_mod/firegl_public.c:347:
include/linux/poll.h:24: warning: empty declaration
include/linux/poll.h:29: error: storage class specified for parameter ‘poll_queue_proc’
include/linux/poll.h:32: error: expected specifier-qualifier-list before ‘poll_queue_proc’
include/linux/poll.h:33: error: storage class specified for parameter ‘poll_table’
include/linux/poll.h:35: error: expected declaration specifiers or ‘...’ before ‘poll_table’
include/linux/poll.h:36: error: expected ‘=’, ‘,’, ‘;’, ‘asm’ or ‘__attribute__’ before ‘{’ token
include/linux/poll.h:41: error: expected ‘)’ before ‘*’ token
include/linux/poll.h:50: warning: empty declaration
include/linux/poll.h:56: error: expected specifier-qualifier-list before ‘poll_table’
include/linux/poll.h:61: warning: empty declaration
include/linux/poll.h:63: error: storage class specified for parameter ‘poll_initwait’
include/linux/poll.h:64: error: storage class specified for parameter ‘poll_freewait’
include/linux/poll.h:73: error: storage class specified for parameter ‘fd_set_bits’
include/linux/poll.h:90: error: expected ‘=’, ‘,’, ‘;’, ‘asm’ or ‘__attribute__’ before ‘{’ token
include/linux/poll.h:101: error: expected ‘=’, ‘,’, ‘;’, ‘asm’ or ‘__attribute__’ before ‘{’ token
include/linux/poll.h:109: error: expected ‘=’, ‘,’, ‘;’, ‘asm’ or ‘__attribute__’ before ‘{’ token
include/linux/poll.h:115: error: expected declaration specifiers or ‘...’ before ‘fd_set_bits’
include/linux/poll.h:115: error: storage class specified for parameter ‘do_select’
include/linux/poll.h:117: error: storage class specified for parameter ‘do_sys_poll’
In file included from /var/tmp/portage/x11-drivers/ati-drivers-8.33.6-r90/work/common/lib/modules/fglrx/build_mod/drmP.h:83,
                 from /var/tmp/portage/x11-drivers/ati-drivers-8.33.6-r90/work/common/lib/modules/fglrx/build_mod/drm_proc.h:41,
                 from /var/tmp/portage/x11-drivers/ati-drivers-8.33.6-r90/work/common/lib/modules/fglrx/build_mod/firegl_public.c:347:
include/asm/pgalloc.h:18: error: storage class specified for parameter ‘pgd_alloc’
include/asm/pgalloc.h:19: error: storage class specified for parameter ‘pgd_free’
include/asm/pgalloc.h:21: error: storage class specified for parameter ‘pte_alloc_one_kernel’
include/asm/pgalloc.h:22: error: storage class specified for parameter ‘pte_alloc_one’
include/asm/pgalloc.h:25: error: expected ‘=’, ‘,’, ‘;’, ‘asm’ or ‘__attribute__’ before ‘{’ token
include/asm/pgalloc.h:30: error: expected ‘=’, ‘,’, ‘;’, ‘asm’ or ‘__attribute__’ before ‘{’ token
In file included from /var/tmp/portage/x11-drivers/ati-drivers-8.33.6-r90/work/common/lib/modules/fglrx/build_mod/drm_proc.h:41,
                 from /var/tmp/portage/x11-drivers/ati-drivers-8.33.6-r90/work/common/lib/modules/fglrx/build_mod/firegl_public.c:347:
/var/tmp/portage/x11-drivers/ati-drivers-8.33.6-r90/work/common/lib/modules/fglrx/build_mod/drmP.h:324: error: storage class specified for parameter ‘drm_ioctl_t’
/var/tmp/portage/x11-drivers/ati-drivers-8.33.6-r90/work/common/lib/modules/fglrx/build_mod/drmP.h:327: error: expected specifier-qualifier-list before ‘drm_ioctl_t’
/var/tmp/portage/x11-drivers/ati-drivers-8.33.6-r90/work/common/lib/modules/fglrx/build_mod/drmP.h:330: error: storage class specified for parameter ‘drm_ioctl_desc_t’
/var/tmp/portage/x11-drivers/ati-drivers-8.33.6-r90/work/common/lib/modules/fglrx/build_mod/drmP.h:334: error: storage class specified for parameter ‘drm_devstate_t’
/var/tmp/portage/x11-drivers/ati-drivers-8.33.6-r90/work/common/lib/modules/fglrx/build_mod/drmP.h:337: error: expected specifier-qualifier-list before ‘drm_magic_t’
/var/tmp/portage/x11-drivers/ati-drivers-8.33.6-r90/work/common/lib/modules/fglrx/build_mod/drmP.h:340: error: storage class specified for parameter ‘drm_magic_entry_t’
/var/tmp/portage/x11-drivers/ati-drivers-8.33.6-r90/work/common/lib/modules/fglrx/build_mod/drmP.h:345: error: storage class specified for parameter ‘drm_magic_head_t’
/var/tmp/portage/x11-drivers/ati-drivers-8.33.6-r90/work/common/lib/modules/fglrx/build_mod/drmP.h:351: error: storage class specified for parameter ‘drm_vma_entry_t’
/var/tmp/portage/x11-drivers/ati-drivers-8.33.6-r90/work/common/lib/modules/fglrx/build_mod/drmP.h:382: error: storage class specified for parameter ‘drm_buf_t’
/var/tmp/portage/x11-drivers/ati-drivers-8.33.6-r90/work/common/lib/modules/fglrx/build_mod/drmP.h:388: error: expected specifier-qualifier-list before ‘drm_buf_t’
/var/tmp/portage/x11-drivers/ati-drivers-8.33.6-r90/work/common/lib/modules/fglrx/build_mod/drmP.h:394: error: storage class specified for parameter ‘drm_waitlist_t’
/var/tmp/portage/x11-drivers/ati-drivers-8.33.6-r90/work/common/lib/modules/fglrx/build_mod/drmP.h:399: error: expected specifier-qualifier-list before ‘drm_buf_t’
/var/tmp/portage/x11-drivers/ati-drivers-8.33.6-r90/work/common/lib/modules/fglrx/build_mod/drmP.h:406: error: storage class specified for parameter ‘drm_freelist_t’
/var/tmp/portage/x11-drivers/ati-drivers-8.33.6-r90/work/common/lib/modules/fglrx/build_mod/drmP.h:414: error: expected specifier-qualifier-list before ‘drm_buf_t’
/var/tmp/portage/x11-drivers/ati-drivers-8.33.6-r90/work/common/lib/modules/fglrx/build_mod/drmP.h:420: error: storage class specified for parameter ‘drm_buf_entry_t’
/var/tmp/portage/x11-drivers/ati-drivers-8.33.6-r90/work/common/lib/modules/fglrx/build_mod/drmP.h:428: error: expected specifier-qualifier-list before ‘drm_magic_t’
/var/tmp/portage/x11-drivers/ati-drivers-8.33.6-r90/work/common/lib/modules/fglrx/build_mod/drmP.h:438: error: storage class specified for parameter ‘drm_file_t’
/var/tmp/portage/x11-drivers/ati-drivers-8.33.6-r90/work/common/lib/modules/fglrx/build_mod/drmP.h:454: error: expected specifier-qualifier-list before ‘drm_ctx_flags_t’
/var/tmp/portage/x11-drivers/ati-drivers-8.33.6-r90/work/common/lib/modules/fglrx/build_mod/drmP.h:457: error: storage class specified for parameter ‘drm_queue_t’
/var/tmp/portage/x11-drivers/ati-drivers-8.33.6-r90/work/common/lib/modules/fglrx/build_mod/drmP.h:463: error: expected specifier-qualifier-list before ‘drm_hw_lock_t’
/var/tmp/portage/x11-drivers/ati-drivers-8.33.6-r90/work/common/lib/modules/fglrx/build_mod/drmP.h:467: error: storage class specified for parameter ‘drm_lock_data_t’
/var/tmp/portage/x11-drivers/ati-drivers-8.33.6-r90/work/common/lib/modules/fglrx/build_mod/drmP.h:474: error: expected specifier-qualifier-list before ‘drm_buf_entry_t’
/var/tmp/portage/x11-drivers/ati-drivers-8.33.6-r90/work/common/lib/modules/fglrx/build_mod/drmP.h:493: error: storage class specified for parameter ‘drm_device_dma_t’
/var/tmp/portage/x11-drivers/ati-drivers-8.33.6-r90/work/common/lib/modules/fglrx/build_mod/drmP.h:535: error: storage class specified for parameter ‘drm_sg_mem_t’
/var/tmp/portage/x11-drivers/ati-drivers-8.33.6-r90/work/common/lib/modules/fglrx/build_mod/drmP.h:539: error: expected specifier-qualifier-list before ‘drm_hw_lock_t’
/var/tmp/portage/x11-drivers/ati-drivers-8.33.6-r90/work/common/lib/modules/fglrx/build_mod/drmP.h:540: error: storage class specified for parameter ‘drm_sigdata_t’
/var/tmp/portage/x11-drivers/ati-drivers-8.33.6-r90/work/common/lib/modules/fglrx/build_mod/drmP.h:547: error: expected specifier-qualifier-list before ‘drm_map_t’
/var/tmp/portage/x11-drivers/ati-drivers-8.33.6-r90/work/common/lib/modules/fglrx/build_mod/drmP.h:548: error: storage class specified for parameter ‘drm_map_list_t’
/var/tmp/portage/x11-drivers/ati-drivers-8.33.6-r90/work/common/lib/modules/fglrx/build_mod/drmP.h:550: error: expected ‘=’, ‘,’, ‘;’, ‘asm’ or ‘__attribute__’ before ‘drm_local_map_t’
/var/tmp/portage/x11-drivers/ati-drivers-8.33.6-r90/work/common/lib/modules/fglrx/build_mod/drmP.h:557: error: expected specifier-qualifier-list before ‘drm_context_t’
/var/tmp/portage/x11-drivers/ati-drivers-8.33.6-r90/work/common/lib/modules/fglrx/build_mod/drmP.h:559: error: storage class specified for parameter ‘drm_ctx_list_t’
/var/tmp/portage/x11-drivers/ati-drivers-8.33.6-r90/work/common/lib/modules/fglrx/build_mod/drmP.h:594: error: expected specifier-qualifier-list before ‘drm_stat_type_t’
/var/tmp/portage/x11-drivers/ati-drivers-8.33.6-r90/work/common/lib/modules/fglrx/build_mod/drmP.h:684: error: storage class specified for parameter ‘drm_device_t’
/var/tmp/portage/x11-drivers/ati-drivers-8.33.6-r90/work/common/lib/modules/fglrx/build_mod/drmP.h:692: error: storage class specified for parameter ‘FGLDRM_flags’
/var/tmp/portage/x11-drivers/ati-drivers-8.33.6-r90/work/common/lib/modules/fglrx/build_mod/drmP.h:693: error: storage class specified for parameter ‘FGLDRM_parse_options’
/var/tmp/portage/x11-drivers/ati-drivers-8.33.6-r90/work/common/lib/modules/fglrx/build_mod/drmP.h:694: error: storage class specified for parameter ‘FGLDRM_cpu_valid’
/var/tmp/portage/x11-drivers/ati-drivers-8.33.6-r90/work/common/lib/modules/fglrx/build_mod/drmP.h:698: error: storage class specified for parameter ‘FGLDRM_version’
/var/tmp/portage/x11-drivers/ati-drivers-8.33.6-r90/work/common/lib/modules/fglrx/build_mod/drmP.h:699: error: storage class specified for parameter ‘FGLDRM_open’
/var/tmp/portage/x11-drivers/ati-drivers-8.33.6-r90/work/common/lib/modules/fglrx/build_mod/drmP.h:700: error: storage class specified for parameter ‘FGLDRM_release’
/var/tmp/portage/x11-drivers/ati-drivers-8.33.6-r90/work/common/lib/modules/fglrx/build_mod/drmP.h:702: error: storage class specified for parameter ‘FGLDRM_ioctl’
/var/tmp/portage/x11-drivers/ati-drivers-8.33.6-r90/work/common/lib/modules/fglrx/build_mod/drmP.h:704: error: storage class specified for parameter ‘FGLDRM_lock’
/var/tmp/portage/x11-drivers/ati-drivers-8.33.6-r90/work/common/lib/modules/fglrx/build_mod/drmP.h:706: error: storage class specified for parameter ‘FGLDRM_unlock’
/var/tmp/portage/x11-drivers/ati-drivers-8.33.6-r90/work/common/lib/modules/fglrx/build_mod/drmP.h:707: error: storage class specified for parameter ‘FGLDRM_fb_loaded’
/var/tmp/portage/x11-drivers/ati-drivers-8.33.6-r90/work/common/lib/modules/fglrx/build_mod/drmP.h:711: error: expected declaration specifiers or ‘...’ before ‘drm_device_t’
/var/tmp/portage/x11-drivers/ati-drivers-8.33.6-r90/work/common/lib/modules/fglrx/build_mod/drmP.h:711: error: storage class specified for parameter ‘FGLDRM_open_helper’
/var/tmp/portage/x11-drivers/ati-drivers-8.33.6-r90/work/common/lib/modules/fglrx/build_mod/drmP.h:712: error: storage class specified for parameter ‘FGLDRM_flush’
/var/tmp/portage/x11-drivers/ati-drivers-8.33.6-r90/work/common/lib/modules/fglrx/build_mod/drmP.h:713: error: storage class specified for parameter ‘FGLDRM_fasync’
/var/tmp/portage/x11-drivers/ati-drivers-8.33.6-r90/work/common/lib/modules/fglrx/build_mod/drmP.h:716: error: storage class specified for parameter ‘FGLDRM_vm_open’
/var/tmp/portage/x11-drivers/ati-drivers-8.33.6-r90/work/common/lib/modules/fglrx/build_mod/drmP.h:717: error: storage class specified for parameter ‘FGLDRM_vm_close’
/var/tmp/portage/x11-drivers/ati-drivers-8.33.6-r90/work/common/lib/modules/fglrx/build_mod/drmP.h:718: error: storage class specified for parameter ‘FGLDRM_vm_shm_close’
/var/tmp/portage/x11-drivers/ati-drivers-8.33.6-r90/work/common/lib/modules/fglrx/build_mod/drmP.h:720: error: storage class specified for parameter ‘FGLDRM_mmap_dma’
/var/tmp/portage/x11-drivers/ati-drivers-8.33.6-r90/work/common/lib/modules/fglrx/build_mod/drmP.h:721: error: storage class specified for parameter ‘FGLDRM_mmap’
/var/tmp/portage/x11-drivers/ati-drivers-8.33.6-r90/work/common/lib/modules/fglrx/build_mod/drmP.h:722: error: storage class specified for parameter ‘FGLDRM_poll’
/var/tmp/portage/x11-drivers/ati-drivers-8.33.6-r90/work/common/lib/modules/fglrx/build_mod/drmP.h:723: error: storage class specified for parameter ‘FGLDRM_read’
/var/tmp/portage/x11-drivers/ati-drivers-8.33.6-r90/work/common/lib/modules/fglrx/build_mod/drmP.h:726: error: storage class specified for parameter ‘FGLDRM_mem_init’
/var/tmp/portage/x11-drivers/ati-drivers-8.33.6-r90/work/common/lib/modules/fglrx/build_mod/drmP.h:728: error: storage class specified for parameter ‘FGLDRM_mem_info’
/var/tmp/portage/x11-drivers/ati-drivers-8.33.6-r90/work/common/lib/modules/fglrx/build_mod/drmP.h:729: error: storage class specified for parameter ‘FGLDRM_alloc’
/var/tmp/portage/x11-drivers/ati-drivers-8.33.6-r90/work/common/lib/modules/fglrx/build_mod/drmP.h:730: error: storage class specified for parameter ‘FGLDRM_calloc’
/var/tmp/portage/x11-drivers/ati-drivers-8.33.6-r90/work/common/lib/modules/fglrx/build_mod/drmP.h:732: error: storage class specified for parameter ‘FGLDRM_realloc’
/var/tmp/portage/x11-drivers/ati-drivers-8.33.6-r90/work/common/lib/modules/fglrx/build_mod/drmP.h:733: error: storage class specified for parameter ‘FGLDRM_free’
/var/tmp/portage/x11-drivers/ati-drivers-8.33.6-r90/work/common/lib/modules/fglrx/build_mod/drmP.h:734: error: storage class specified for parameter ‘FGLDRM_alloc_pages’
/var/tmp/portage/x11-drivers/ati-drivers-8.33.6-r90/work/common/lib/modules/fglrx/build_mod/drmP.h:736: error: storage class specified for parameter ‘FGLDRM_free_pages’
/var/tmp/portage/x11-drivers/ati-drivers-8.33.6-r90/work/common/lib/modules/fglrx/build_mod/drmP.h:737: error: expected declaration specifiers or ‘...’ before ‘drm_device_t’
/var/tmp/portage/x11-drivers/ati-drivers-8.33.6-r90/work/common/lib/modules/fglrx/build_mod/drmP.h:737: error: storage class specified for parameter ‘FGLDRM_ioremap’
/var/tmp/portage/x11-drivers/ati-drivers-8.33.6-r90/work/common/lib/modules/fglrx/build_mod/drmP.h:739: error: expected declaration specifiers or ‘...’ before ‘drm_device_t’
/var/tmp/portage/x11-drivers/ati-drivers-8.33.6-r90/work/common/lib/modules/fglrx/build_mod/drmP.h:739: error: storage class specified for parameter ‘FGLDRM_ioremap_nocache’
/var/tmp/portage/x11-drivers/ati-drivers-8.33.6-r90/work/common/lib/modules/fglrx/build_mod/drmP.h:740: error: expected declaration specifiers or ‘...’ before ‘drm_device_t’
/var/tmp/portage/x11-drivers/ati-drivers-8.33.6-r90/work/common/lib/modules/fglrx/build_mod/drmP.h:740: error: storage class specified for parameter ‘FGLDRM_ioremapfree’
/var/tmp/portage/x11-drivers/ati-drivers-8.33.6-r90/work/common/lib/modules/fglrx/build_mod/drmP.h:751: error: storage class specified for parameter ‘FGLDRM_irq_by_busid’
/var/tmp/portage/x11-drivers/ati-drivers-8.33.6-r90/work/common/lib/modules/fglrx/build_mod/drmP.h:753: error: storage class specified for parameter ‘FGLDRM_getunique’
/var/tmp/portage/x11-drivers/ati-drivers-8.33.6-r90/work/common/lib/modules/fglrx/build_mod/drmP.h:755: error: storage class specified for parameter ‘FGLDRM_setunique’
/var/tmp/portage/x11-drivers/ati-drivers-8.33.6-r90/work/common/lib/modules/fglrx/build_mod/drmP.h:757: error: storage class specified for parameter ‘FGLDRM_getmap’
/var/tmp/portage/x11-drivers/ati-drivers-8.33.6-r90/work/common/lib/modules/fglrx/build_mod/drmP.h:759: error: storage class specified for parameter ‘FGLDRM_getclient’
/var/tmp/portage/x11-drivers/ati-drivers-8.33.6-r90/work/common/lib/modules/fglrx/build_mod/drmP.h:761: error: storage class specified for parameter ‘FGLDRM_getstats’
/var/tmp/portage/x11-drivers/ati-drivers-8.33.6-r90/work/common/lib/modules/fglrx/build_mod/drmP.h:763: error: storage class specified for parameter ‘FGLDRM_setversion’
/var/tmp/portage/x11-drivers/ati-drivers-8.33.6-r90/work/common/lib/modules/fglrx/build_mod/drmP.h:767: error: storage class specified for parameter ‘FGLDRM_resctx’
/var/tmp/portage/x11-drivers/ati-drivers-8.33.6-r90/work/common/lib/modules/fglrx/build_mod/drmP.h:769: error: storage class specified for parameter ‘FGLDRM_addctx’
/var/tmp/portage/x11-drivers/ati-drivers-8.33.6-r90/work/common/lib/modules/fglrx/build_mod/drmP.h:771: error: storage class specified for parameter ‘FGLDRM_modctx’
/var/tmp/portage/x11-drivers/ati-drivers-8.33.6-r90/work/common/lib/modules/fglrx/build_mod/drmP.h:773: error: storage class specified for parameter ‘FGLDRM_getctx’
/var/tmp/portage/x11-drivers/ati-drivers-8.33.6-r90/work/common/lib/modules/fglrx/build_mod/drmP.h:775: error: storage class specified for parameter ‘FGLDRM_switchctx’
/var/tmp/portage/x11-drivers/ati-drivers-8.33.6-r90/work/common/lib/modules/fglrx/build_mod/drmP.h:777: error: storage class specified for parameter ‘FGLDRM_newctx’
/var/tmp/portage/x11-drivers/ati-drivers-8.33.6-r90/work/common/lib/modules/fglrx/build_mod/drmP.h:779: error: storage class specified for parameter ‘FGLDRM_rmctx’
/var/tmp/portage/x11-drivers/ati-drivers-8.33.6-r90/work/common/lib/modules/fglrx/build_mod/drmP.h:781: error: expected ‘)’ before ‘*’ token
/var/tmp/portage/x11-drivers/ati-drivers-8.33.6-r90/work/common/lib/modules/fglrx/build_mod/drmP.h:782: error: expected ‘)’ before ‘*’ token
/var/tmp/portage/x11-drivers/ati-drivers-8.33.6-r90/work/common/lib/modules/fglrx/build_mod/drmP.h:790: error: storage class specified for parameter ‘FGLDRM_setsareactx’
/var/tmp/portage/x11-drivers/ati-drivers-8.33.6-r90/work/common/lib/modules/fglrx/build_mod/drmP.h:792: error: storage class specified for parameter ‘FGLDRM_getsareactx’
/var/tmp/portage/x11-drivers/ati-drivers-8.33.6-r90/work/common/lib/modules/fglrx/build_mod/drmP.h:796: error: storage class specified for parameter ‘FGLDRM_adddraw’
/var/tmp/portage/x11-drivers/ati-drivers-8.33.6-r90/work/common/lib/modules/fglrx/build_mod/drmP.h:798: error: storage class specified for parameter ‘FGLDRM_rmdraw’
/var/tmp/portage/x11-drivers/ati-drivers-8.33.6-r90/work/common/lib/modules/fglrx/build_mod/drmP.h:802: error: expected ‘)’ before ‘*’ token
/var/tmp/portage/x11-drivers/ati-drivers-8.33.6-r90/work/common/lib/modules/fglrx/build_mod/drmP.h:804: error: expected ‘)’ before ‘*’ token
/var/tmp/portage/x11-drivers/ati-drivers-8.33.6-r90/work/common/lib/modules/fglrx/build_mod/drmP.h:806: error: storage class specified for parameter ‘FGLDRM_getmagic’
/var/tmp/portage/x11-drivers/ati-drivers-8.33.6-r90/work/common/lib/modules/fglrx/build_mod/drmP.h:808: error: storage class specified for parameter ‘FGLDRM_authmagic’
/var/tmp/portage/x11-drivers/ati-drivers-8.33.6-r90/work/common/lib/modules/fglrx/build_mod/drmP.h:812: error: storage class specified for parameter ‘FGLDRM_noop’
/var/tmp/portage/x11-drivers/ati-drivers-8.33.6-r90/work/common/lib/modules/fglrx/build_mod/drmP.h:816: error: storage class specified for parameter ‘FGLDRM_lock_take’
/var/tmp/portage/x11-drivers/ati-drivers-8.33.6-r90/work/common/lib/modules/fglrx/build_mod/drmP.h:817: error: expected ‘)’ before ‘*’ token
/var/tmp/portage/x11-drivers/ati-drivers-8.33.6-r90/work/common/lib/modules/fglrx/build_mod/drmP.h:820: error: expected ‘)’ before ‘*’ token
/var/tmp/portage/x11-drivers/ati-drivers-8.33.6-r90/work/common/lib/modules/fglrx/build_mod/drmP.h:823: error: storage class specified for parameter ‘FGLDRM_notifier’
/var/tmp/portage/x11-drivers/ati-drivers-8.33.6-r90/work/common/lib/modules/fglrx/build_mod/drmP.h:826: error: storage class specified for parameter ‘FGLDRM_order’
/var/tmp/portage/x11-drivers/ati-drivers-8.33.6-r90/work/common/lib/modules/fglrx/build_mod/drmP.h:828: error: storage class specified for parameter ‘FGLDRM_addmap’
/var/tmp/portage/x11-drivers/ati-drivers-8.33.6-r90/work/common/lib/modules/fglrx/build_mod/drmP.h:830: error: storage class specified for parameter ‘FGLDRM_rmmap’
/var/tmp/portage/x11-drivers/ati-drivers-8.33.6-r90/work/common/lib/modules/fglrx/build_mod/drmP.h:898: error: expected declaration specifiers or ‘...’ before ‘drm_device_t’
/var/tmp/portage/x11-drivers/ati-drivers-8.33.6-r90/work/common/lib/modules/fglrx/build_mod/drmP.h:902: error: expected ‘)’ before ‘*’ token
/var/tmp/portage/x11-drivers/ati-drivers-8.33.6-r90/work/common/lib/modules/fglrx/build_mod/drmP.h:908: error: storage class specified for parameter ‘FGLDRM_proc_cleanup’
/var/tmp/portage/x11-drivers/ati-drivers-8.33.6-r90/work/common/lib/modules/fglrx/build_mod/drmP.h:911: error: expected ‘)’ before ‘*’ token
/var/tmp/portage/x11-drivers/ati-drivers-8.33.6-r90/work/common/lib/modules/fglrx/build_mod/drmP.h:914: error: expected ‘)’ before ‘*’ token
/var/tmp/portage/x11-drivers/ati-drivers-8.33.6-r90/work/common/lib/modules/fglrx/build_mod/drmP.h:918: error: expected ‘)’ before ‘*’ token
/var/tmp/portage/x11-drivers/ati-drivers-8.33.6-r90/work/common/lib/modules/fglrx/build_mod/drmP.h:921: error: expected ‘)’ before ‘*’ token
In file included from /var/tmp/portage/x11-drivers/ati-drivers-8.33.6-r90/work/common/lib/modules/fglrx/build_mod/firegl_public.c:347:
/var/tmp/portage/x11-drivers/ati-drivers-8.33.6-r90/work/common/lib/modules/fglrx/build_mod/drm_proc.h:44: error: storage class specified for parameter ‘FGLDRM_name_info’
/var/tmp/portage/x11-drivers/ati-drivers-8.33.6-r90/work/common/lib/modules/fglrx/build_mod/drm_proc.h:46: error: storage class specified for parameter ‘FGLDRM_vm_info’
/var/tmp/portage/x11-drivers/ati-drivers-8.33.6-r90/work/common/lib/modules/fglrx/build_mod/drm_proc.h:48: error: storage class specified for parameter ‘FGLDRM_clients_info’
/var/tmp/portage/x11-drivers/ati-drivers-8.33.6-r90/work/common/lib/modules/fglrx/build_mod/drm_proc.h:50: error: storage class specified for parameter ‘FGLDRM_queues_info’
/var/tmp/portage/x11-drivers/ati-drivers-8.33.6-r90/work/common/lib/modules/fglrx/build_mod/drm_proc.h:52: error: storage class specified for parameter ‘FGLDRM_bufs_info’
/var/tmp/portage/x11-drivers/ati-drivers-8.33.6-r90/work/common/lib/modules/fglrx/build_mod/drm_proc.h:55: error: storage class specified for parameter ‘FGLDRM_vma_info’
/var/tmp/portage/x11-drivers/ati-drivers-8.33.6-r90/work/common/lib/modules/fglrx/build_mod/drm_proc.h:64: error: parameter ‘FGLDRM_proc_list’ is initialized
/var/tmp/portage/x11-drivers/ati-drivers-8.33.6-r90/work/common/lib/modules/fglrx/build_mod/drm_proc.h:65: warning: braces around scalar initializer
/var/tmp/portage/x11-drivers/ati-drivers-8.33.6-r90/work/common/lib/modules/fglrx/build_mod/drm_proc.h:65: warning: (near initialization for ‘FGLDRM_proc_list’)
/var/tmp/portage/x11-drivers/ati-drivers-8.33.6-r90/work/common/lib/modules/fglrx/build_mod/drm_proc.h:65: warning: initialization from incompatible pointer type
/var/tmp/portage/x11-drivers/ati-drivers-8.33.6-r90/work/common/lib/modules/fglrx/build_mod/drm_proc.h:65: warning: excess elements in scalar initializer
/var/tmp/portage/x11-drivers/ati-drivers-8.33.6-r90/work/common/lib/modules/fglrx/build_mod/drm_proc.h:65: warning: (near initialization for ‘FGLDRM_proc_list’)
/var/tmp/portage/x11-drivers/ati-drivers-8.33.6-r90/work/common/lib/modules/fglrx/build_mod/drm_proc.h:66: warning: braces around scalar initializer
/var/tmp/portage/x11-drivers/ati-drivers-8.33.6-r90/work/common/lib/modules/fglrx/build_mod/drm_proc.h:66: warning: (near initialization for ‘FGLDRM_proc_list’)
/var/tmp/portage/x11-drivers/ati-drivers-8.33.6-r90/work/common/lib/modules/fglrx/build_mod/drm_proc.h:66: warning: initialization from incompatible pointer type
/var/tmp/portage/x11-drivers/ati-drivers-8.33.6-r90/work/common/lib/modules/fglrx/build_mod/drm_proc.h:66: warning: excess elements in scalar initializer
/var/tmp/portage/x11-drivers/ati-drivers-8.33.6-r90/work/common/lib/modules/fglrx/build_mod/drm_proc.h:66: warning: (near initialization for ‘FGLDRM_proc_list’)
/var/tmp/portage/x11-drivers/ati-drivers-8.33.6-r90/work/common/lib/modules/fglrx/build_mod/drm_proc.h:66: warning: excess elements in scalar initializer
/var/tmp/portage/x11-drivers/ati-drivers-8.33.6-r90/work/common/lib/modules/fglrx/build_mod/drm_proc.h:66: warning: (near initialization for ‘FGLDRM_proc_list’)
/var/tmp/portage/x11-drivers/ati-drivers-8.33.6-r90/work/common/lib/modules/fglrx/build_mod/drm_proc.h:67: warning: braces around scalar initializer
/var/tmp/portage/x11-drivers/ati-drivers-8.33.6-r90/work/common/lib/modules/fglrx/build_mod/drm_proc.h:67: warning: (near initialization for ‘FGLDRM_proc_list’)
/var/tmp/portage/x11-drivers/ati-drivers-8.33.6-r90/work/common/lib/modules/fglrx/build_mod/drm_proc.h:67: warning: initialization from incompatible pointer type
/var/tmp/portage/x11-drivers/ati-drivers-8.33.6-r90/work/common/lib/modules/fglrx/build_mod/drm_proc.h:67: warning: excess elements in scalar initializer
/var/tmp/portage/x11-drivers/ati-drivers-8.33.6-r90/work/common/lib/modules/fglrx/build_mod/drm_proc.h:67: warning: (near initialization for ‘FGLDRM_proc_list’)
/var/tmp/portage/x11-drivers/ati-drivers-8.33.6-r90/work/common/lib/modules/fglrx/build_mod/drm_proc.h:67: warning: excess elements in scalar initializer
/var/tmp/portage/x11-drivers/ati-drivers-8.33.6-r90/work/common/lib/modules/fglrx/build_mod/drm_proc.h:67: warning: (near initialization for ‘FGLDRM_proc_list’)
/var/tmp/portage/x11-drivers/ati-drivers-8.33.6-r90/work/common/lib/modules/fglrx/build_mod/drm_proc.h:68: warning: braces around scalar initializer
/var/tmp/portage/x11-drivers/ati-drivers-8.33.6-r90/work/common/lib/modules/fglrx/build_mod/drm_proc.h:68: warning: (near initialization for ‘FGLDRM_proc_list’)
/var/tmp/portage/x11-drivers/ati-drivers-8.33.6-r90/work/common/lib/modules/fglrx/build_mod/drm_proc.h:68: warning: initialization from incompatible pointer type
/var/tmp/portage/x11-drivers/ati-drivers-8.33.6-r90/work/common/lib/modules/fglrx/build_mod/drm_proc.h:68: warning: excess elements in scalar initializer
/var/tmp/portage/x11-drivers/ati-drivers-8.33.6-r90/work/common/lib/modules/fglrx/build_mod/drm_proc.h:68: warning: (near initialization for ‘FGLDRM_proc_list’)
/var/tmp/portage/x11-drivers/ati-drivers-8.33.6-r90/work/common/lib/modules/fglrx/build_mod/drm_proc.h:68: warning: excess elements in scalar initializer
/var/tmp/portage/x11-drivers/ati-drivers-8.33.6-r90/work/common/lib/modules/fglrx/build_mod/drm_proc.h:68: warning: (near initialization for ‘FGLDRM_proc_list’)
/var/tmp/portage/x11-drivers/ati-drivers-8.33.6-r90/work/common/lib/modules/fglrx/build_mod/drm_proc.h:69: warning: braces around scalar initializer
/var/tmp/portage/x11-drivers/ati-drivers-8.33.6-r90/work/common/lib/modules/fglrx/build_mod/drm_proc.h:69: warning: (near initialization for ‘FGLDRM_proc_list’)
/var/tmp/portage/x11-drivers/ati-drivers-8.33.6-r90/work/common/lib/modules/fglrx/build_mod/drm_proc.h:69: warning: initialization from incompatible pointer type
/var/tmp/portage/x11-drivers/ati-drivers-8.33.6-r90/work/common/lib/modules/fglrx/build_mod/drm_proc.h:69: warning: excess elements in scalar initializer
/var/tmp/portage/x11-drivers/ati-drivers-8.33.6-r90/work/common/lib/modules/fglrx/build_mod/drm_proc.h:69: warning: (near initialization for ‘FGLDRM_proc_list’)
/var/tmp/portage/x11-drivers/ati-drivers-8.33.6-r90/work/common/lib/modules/fglrx/build_mod/drm_proc.h:69: warning: excess elements in scalar initializer
/var/tmp/portage/x11-drivers/ati-drivers-8.33.6-r90/work/common/lib/modules/fglrx/build_mod/drm_proc.h:69: warning: (near initialization for ‘FGLDRM_proc_list’)
/var/tmp/portage/x11-drivers/ati-drivers-8.33.6-r90/work/common/lib/modules/fglrx/build_mod/drm_proc.h:70: warning: braces around scalar initializer
/var/tmp/portage/x11-drivers/ati-drivers-8.33.6-r90/work/common/lib/modules/fglrx/build_mod/drm_proc.h:70: warning: (near initialization for ‘FGLDRM_proc_list’)
/var/tmp/portage/x11-drivers/ati-drivers-8.33.6-r90/work/common/lib/modules/fglrx/build_mod/drm_proc.h:70: warning: initialization from incompatible pointer type
/var/tmp/portage/x11-drivers/ati-drivers-8.33.6-r90/work/common/lib/modules/fglrx/build_mod/drm_proc.h:70: warning: excess elements in scalar initializer
/var/tmp/portage/x11-drivers/ati-drivers-8.33.6-r90/work/common/lib/modules/fglrx/build_mod/drm_proc.h:70: warning: (near initialization for ‘FGLDRM_proc_list’)
/var/tmp/portage/x11-drivers/ati-drivers-8.33.6-r90/work/common/lib/modules/fglrx/build_mod/drm_proc.h:70: warning: excess elements in scalar initializer
/var/tmp/portage/x11-drivers/ati-drivers-8.33.6-r90/work/common/lib/modules/fglrx/build_mod/drm_proc.h:70: warning: (near initialization for ‘FGLDRM_proc_list’)
/var/tmp/portage/x11-drivers/ati-drivers-8.33.6-r90/work/common/lib/modules/fglrx/build_mod/drm_proc.h:72: warning: braces around scalar initializer
/var/tmp/portage/x11-drivers/ati-drivers-8.33.6-r90/work/common/lib/modules/fglrx/build_mod/drm_proc.h:72: warning: (near initialization for ‘FGLDRM_proc_list’)
/var/tmp/portage/x11-drivers/ati-drivers-8.33.6-r90/work/common/lib/modules/fglrx/build_mod/drm_proc.h:72: warning: initialization from incompatible pointer type
/var/tmp/portage/x11-drivers/ati-drivers-8.33.6-r90/work/common/lib/modules/fglrx/build_mod/drm_proc.h:72: warning: excess elements in scalar initializer
/var/tmp/portage/x11-drivers/ati-drivers-8.33.6-r90/work/common/lib/modules/fglrx/build_mod/drm_proc.h:72: warning: (near initialization for ‘FGLDRM_proc_list’)
/var/tmp/portage/x11-drivers/ati-drivers-8.33.6-r90/work/common/lib/modules/fglrx/build_mod/drm_proc.h:72: warning: excess elements in scalar initializer
/var/tmp/portage/x11-drivers/ati-drivers-8.33.6-r90/work/common/lib/modules/fglrx/build_mod/drm_proc.h:72: warning: (near initialization for ‘FGLDRM_proc_list’)
/var/tmp/portage/x11-drivers/ati-drivers-8.33.6-r90/work/common/lib/modules/fglrx/build_mod/drm_proc.h:90: error: expected ‘)’ before ‘*’ token
/var/tmp/portage/x11-drivers/ati-drivers-8.33.6-r90/work/common/lib/modules/fglrx/build_mod/drm_proc.h:144: error: expected ‘=’, ‘,’, ‘;’, ‘asm’ or ‘__attribute__’ before ‘{’ token
/var/tmp/portage/x11-drivers/ati-drivers-8.33.6-r90/work/common/lib/modules/fglrx/build_mod/drm_proc.h:174: error: expected ‘=’, ‘,’, ‘;’, ‘asm’ or ‘__attribute__’ before ‘{’ token
/var/tmp/portage/x11-drivers/ati-drivers-8.33.6-r90/work/common/lib/modules/fglrx/build_mod/drm_proc.h:213: error: expected ‘=’, ‘,’, ‘;’, ‘asm’ or ‘__attribute__’ before ‘{’ token
/var/tmp/portage/x11-drivers/ati-drivers-8.33.6-r90/work/common/lib/modules/fglrx/build_mod/drm_proc.h:269: error: expected ‘=’, ‘,’, ‘;’, ‘asm’ or ‘__attribute__’ before ‘{’ token
/var/tmp/portage/x11-drivers/ati-drivers-8.33.6-r90/work/common/lib/modules/fglrx/build_mod/drm_proc.h:292: error: expected ‘=’, ‘,’, ‘;’, ‘asm’ or ‘__attribute__’ before ‘{’ token
/var/tmp/portage/x11-drivers/ati-drivers-8.33.6-r90/work/common/lib/modules/fglrx/build_mod/drm_proc.h:339: error: expected ‘=’, ‘,’, ‘;’, ‘asm’ or ‘__attribute__’ before ‘{’ token
/var/tmp/portage/x11-drivers/ati-drivers-8.33.6-r90/work/common/lib/modules/fglrx/build_mod/drm_proc.h:362: error: expected ‘=’, ‘,’, ‘;’, ‘asm’ or ‘__attribute__’ before ‘{’ token
/var/tmp/portage/x11-drivers/ati-drivers-8.33.6-r90/work/common/lib/modules/fglrx/build_mod/drm_proc.h:409: error: expected ‘=’, ‘,’, ‘;’, ‘asm’ or ‘__attribute__’ before ‘{’ token
/var/tmp/portage/x11-drivers/ati-drivers-8.33.6-r90/work/common/lib/modules/fglrx/build_mod/drm_proc.h:432: error: expected ‘=’, ‘,’, ‘;’, ‘asm’ or ‘__attribute__’ before ‘{’ token
/var/tmp/portage/x11-drivers/ati-drivers-8.33.6-r90/work/common/lib/modules/fglrx/build_mod/drm_proc.h:466: error: expected ‘=’, ‘,’, ‘;’, ‘asm’ or ‘__attribute__’ before ‘{’ token
/var/tmp/portage/x11-drivers/ati-drivers-8.33.6-r90/work/common/lib/modules/fglrx/build_mod/drm_proc.h:480: error: expected ‘=’, ‘,’, ‘;’, ‘asm’ or ‘__attribute__’ before ‘{’ token
/var/tmp/portage/x11-drivers/ati-drivers-8.33.6-r90/work/common/lib/modules/fglrx/build_mod/drm_proc.h:537: error: expected ‘=’, ‘,’, ‘;’, ‘asm’ or ‘__attribute__’ before ‘{’ token
/var/tmp/portage/x11-drivers/ati-drivers-8.33.6-r90/work/common/lib/modules/fglrx/build_mod/firegl_public.c:353: error: storage class specified for parameter ‘drm_proclist’
/var/tmp/portage/x11-drivers/ati-drivers-8.33.6-r90/work/common/lib/modules/fglrx/build_mod/firegl_public.c:353: error: parameter ‘drm_proclist’ is initialized
/var/tmp/portage/x11-drivers/ati-drivers-8.33.6-r90/work/common/lib/modules/fglrx/build_mod/firegl_public.c:365: error: storage class specified for parameter ‘firegl_stub_list_t’
/var/tmp/portage/x11-drivers/ati-drivers-8.33.6-r90/work/common/lib/modules/fglrx/build_mod/firegl_public.c:366: error: expected ‘=’, ‘,’, ‘;’, ‘asm’ or ‘__attribute__’ before ‘firegl_stub_list’
/var/tmp/portage/x11-drivers/ati-drivers-8.33.6-r90/work/common/lib/modules/fglrx/build_mod/firegl_public.c:368: error: storage class specified for parameter ‘firegl_stub_root’
/var/tmp/portage/x11-drivers/ati-drivers-8.33.6-r90/work/common/lib/modules/fglrx/build_mod/firegl_public.c:369: error: storage class specified for parameter ‘firegl_minor’
/var/tmp/portage/x11-drivers/ati-drivers-8.33.6-r90/work/common/lib/modules/fglrx/build_mod/firegl_public.c:372: error: expected declaration specifiers or ‘...’ before ‘device_t’
/var/tmp/portage/x11-drivers/ati-drivers-8.33.6-r90/work/common/lib/modules/fglrx/build_mod/firegl_public.c:375: error: storage class specified for parameter ‘firegl_drm_stub_info_t’
/var/tmp/portage/x11-drivers/ati-drivers-8.33.6-r90/work/common/lib/modules/fglrx/build_mod/firegl_public.c:376: error: expected ‘=’, ‘,’, ‘;’, ‘asm’ or ‘__attribute__’ before ‘firegl_stub_info’
/var/tmp/portage/x11-drivers/ati-drivers-8.33.6-r90/work/common/lib/modules/fglrx/build_mod/firegl_public.c:378: error: storage class specified for parameter ‘__ke_pte_phys_addr_str’
/var/tmp/portage/x11-drivers/ati-drivers-8.33.6-r90/work/common/lib/modules/fglrx/build_mod/firegl_public.c:381: error: expected ‘=’, ‘,’, ‘;’, ‘asm’ or ‘__attribute__’ before ‘{’ token
/var/tmp/portage/x11-drivers/ati-drivers-8.33.6-r90/work/common/lib/modules/fglrx/build_mod/firegl_public.c:386: error: expected ‘=’, ‘,’, ‘;’, ‘asm’ or ‘__attribute__’ before ‘{’ token
/var/tmp/portage/x11-drivers/ati-drivers-8.33.6-r90/work/common/lib/modules/fglrx/build_mod/firegl_public.c:397: error: expected ‘=’, ‘,’, ‘;’, ‘asm’ or ‘__attribute__’ before ‘{’ token
/var/tmp/portage/x11-drivers/ati-drivers-8.33.6-r90/work/common/lib/modules/fglrx/build_mod/firegl_public.c:398: error: expected ‘=’, ‘,’, ‘;’, ‘asm’ or ‘__attribute__’ before ‘{’ token
/var/tmp/portage/x11-drivers/ati-drivers-8.33.6-r90/work/common/lib/modules/fglrx/build_mod/firegl_public.c:399: error: expected ‘=’, ‘,’, ‘;’, ‘asm’ or ‘__attribute__’ before ‘{’ token
/var/tmp/portage/x11-drivers/ati-drivers-8.33.6-r90/work/common/lib/modules/fglrx/build_mod/firegl_public.c:400: error: expected ‘=’, ‘,’, ‘;’, ‘asm’ or ‘__attribute__’ before ‘{’ token
/var/tmp/portage/x11-drivers/ati-drivers-8.33.6-r90/work/common/lib/modules/fglrx/build_mod/firegl_public.c:401: error: expected ‘=’, ‘,’, ‘;’, ‘asm’ or ‘__attribute__’ before ‘{’ token
/var/tmp/portage/x11-drivers/ati-drivers-8.33.6-r90/work/common/lib/modules/fglrx/build_mod/firegl_public.c:402: error: expected ‘=’, ‘,’, ‘;’, ‘asm’ or ‘__attribute__’ before ‘{’ token
/var/tmp/portage/x11-drivers/ati-drivers-8.33.6-r90/work/common/lib/modules/fglrx/build_mod/firegl_public.c:403: error: expected ‘=’, ‘,’, ‘;’, ‘asm’ or ‘__attribute__’ before ‘{’ token
/var/tmp/portage/x11-drivers/ati-drivers-8.33.6-r90/work/common/lib/modules/fglrx/build_mod/firegl_public.c:408: error: expected ‘=’, ‘,’, ‘;’, ‘asm’ or ‘__attribute__’ before ‘{’ token
/var/tmp/portage/x11-drivers/ati-drivers-8.33.6-r90/work/common/lib/modules/fglrx/build_mod/firegl_public.c:414: error: expected ‘=’, ‘,’, ‘;’, ‘asm’ or ‘__attribute__’ before ‘{’ token
/var/tmp/portage/x11-drivers/ati-drivers-8.33.6-r90/work/common/lib/modules/fglrx/build_mod/firegl_public.c:422: error: expected ‘=’, ‘,’, ‘;’, ‘asm’ or ‘__attribute__’ before ‘{’ token
/var/tmp/portage/x11-drivers/ati-drivers-8.33.6-r90/work/common/lib/modules/fglrx/build_mod/firegl_public.c:432: error: expected ‘=’, ‘,’, ‘;’, ‘asm’ or ‘__attribute__’ before ‘{’ token
/var/tmp/portage/x11-drivers/ati-drivers-8.33.6-r90/work/common/lib/modules/fglrx/build_mod/firegl_public.c:437: error: expected declaration specifiers or ‘...’ before ‘poll_table’
/var/tmp/portage/x11-drivers/ati-drivers-8.33.6-r90/work/common/lib/modules/fglrx/build_mod/firegl_public.c:438: error: expected ‘=’, ‘,’, ‘;’, ‘asm’ or ‘__attribute__’ before ‘{’ token
/var/tmp/portage/x11-drivers/ati-drivers-8.33.6-r90/work/common/lib/modules/fglrx/build_mod/firegl_public.c:455: error: expected ‘=’, ‘,’, ‘;’, ‘asm’ or ‘__attribute__’ before ‘{’ token
/var/tmp/portage/x11-drivers/ati-drivers-8.33.6-r90/work/common/lib/modules/fglrx/build_mod/firegl_public.c:459: error: storage class specified for parameter ‘firegl_interrupt_file_ops’
/var/tmp/portage/x11-drivers/ati-drivers-8.33.6-r90/work/common/lib/modules/fglrx/build_mod/firegl_public.c:459: error: parameter ‘firegl_interrupt_file_ops’ is initialized
/var/tmp/portage/x11-drivers/ati-drivers-8.33.6-r90/work/common/lib/modules/fglrx/build_mod/firegl_public.c:460: error: ‘firegl_interrupt_open_wrap’ undeclared (first use in this function)
/var/tmp/portage/x11-drivers/ati-drivers-8.33.6-r90/work/common/lib/modules/fglrx/build_mod/firegl_public.c:461: error: ‘firegl_interrupt_read_wrap’ undeclared (first use in this function)
/var/tmp/portage/x11-drivers/ati-drivers-8.33.6-r90/work/common/lib/modules/fglrx/build_mod/firegl_public.c:462: error: ‘firegl_interrupt_release_wrap’ undeclared (first use in this function)
/var/tmp/portage/x11-drivers/ati-drivers-8.33.6-r90/work/common/lib/modules/fglrx/build_mod/firegl_public.c:463: error: ‘firegl_interrupt_poll_wrap’ undeclared (first use in this function)
/var/tmp/portage/x11-drivers/ati-drivers-8.33.6-r90/work/common/lib/modules/fglrx/build_mod/firegl_public.c:464: error: ‘firegl_interrupt_write_wrap’ undeclared (first use in this function)
/var/tmp/portage/x11-drivers/ati-drivers-8.33.6-r90/work/common/lib/modules/fglrx/build_mod/firegl_public.c:467: error: parameter ‘firegl_proc_list’ is initialized
/var/tmp/portage/x11-drivers/ati-drivers-8.33.6-r90/work/common/lib/modules/fglrx/build_mod/firegl_public.c:469: warning: braces around scalar initializer
/var/tmp/portage/x11-drivers/ati-drivers-8.33.6-r90/work/common/lib/modules/fglrx/build_mod/firegl_public.c:469: warning: (near initialization for ‘firegl_proc_list’)
/var/tmp/portage/x11-drivers/ati-drivers-8.33.6-r90/work/common/lib/modules/fglrx/build_mod/firegl_public.c:469: warning: initialization from incompatible pointer type
/var/tmp/portage/x11-drivers/ati-drivers-8.33.6-r90/work/common/lib/modules/fglrx/build_mod/firegl_public.c:469: error: ‘drm_name_info_wrap’ undeclared (first use in this function)
/var/tmp/portage/x11-drivers/ati-drivers-8.33.6-r90/work/common/lib/modules/fglrx/build_mod/firegl_public.c:469: warning: excess elements in scalar initializer
/var/tmp/portage/x11-drivers/ati-drivers-8.33.6-r90/work/common/lib/modules/fglrx/build_mod/firegl_public.c:469: warning: (near initialization for ‘firegl_proc_list’)
/var/tmp/portage/x11-drivers/ati-drivers-8.33.6-r90/work/common/lib/modules/fglrx/build_mod/firegl_public.c:469: warning: excess elements in scalar initializer
/var/tmp/portage/x11-drivers/ati-drivers-8.33.6-r90/work/common/lib/modules/fglrx/build_mod/firegl_public.c:469: warning: (near initialization for ‘firegl_proc_list’)
/var/tmp/portage/x11-drivers/ati-drivers-8.33.6-r90/work/common/lib/modules/fglrx/build_mod/firegl_public.c:470: warning: braces around scalar initializer
/var/tmp/portage/x11-drivers/ati-drivers-8.33.6-r90/work/common/lib/modules/fglrx/build_mod/firegl_public.c:470: warning: (near initialization for ‘firegl_proc_list’)
/var/tmp/portage/x11-drivers/ati-drivers-8.33.6-r90/work/common/lib/modules/fglrx/build_mod/firegl_public.c:470: warning: initialization from incompatible pointer type
/var/tmp/portage/x11-drivers/ati-drivers-8.33.6-r90/work/common/lib/modules/fglrx/build_mod/firegl_public.c:470: error: ‘drm_mem_info_wrap’ undeclared (first use in this function)
/var/tmp/portage/x11-drivers/ati-drivers-8.33.6-r90/work/common/lib/modules/fglrx/build_mod/firegl_public.c:470: warning: excess elements in scalar initializer
/var/tmp/portage/x11-drivers/ati-drivers-8.33.6-r90/work/common/lib/modules/fglrx/build_mod/firegl_public.c:470: warning: (near initialization for ‘firegl_proc_list’)
/var/tmp/portage/x11-drivers/ati-drivers-8.33.6-r90/work/common/lib/modules/fglrx/build_mod/firegl_public.c:470: warning: excess elements in scalar initializer
/var/tmp/portage/x11-drivers/ati-drivers-8.33.6-r90/work/common/lib/modules/fglrx/build_mod/firegl_public.c:470: warning: (near initialization for ‘firegl_proc_list’)
/var/tmp/portage/x11-drivers/ati-drivers-8.33.6-r90/work/common/lib/modules/fglrx/build_mod/firegl_public.c:470: warning: excess elements in scalar initializer
/var/tmp/portage/x11-drivers/ati-drivers-8.33.6-r90/work/common/lib/modules/fglrx/build_mod/firegl_public.c:470: warning: (near initialization for ‘firegl_proc_list’)
/var/tmp/portage/x11-drivers/ati-drivers-8.33.6-r90/work/common/lib/modules/fglrx/build_mod/firegl_public.c:471: warning: braces around scalar initializer
/var/tmp/portage/x11-drivers/ati-drivers-8.33.6-r90/work/common/lib/modules/fglrx/build_mod/firegl_public.c:471: warning: (near initialization for ‘firegl_proc_list’)
/var/tmp/portage/x11-drivers/ati-drivers-8.33.6-r90/work/common/lib/modules/fglrx/build_mod/firegl_public.c:471: warning: initialization from incompatible pointer type
/var/tmp/portage/x11-drivers/ati-drivers-8.33.6-r90/work/common/lib/modules/fglrx/build_mod/firegl_public.c:471: error: ‘drm_mem_info1_wrap’ undeclared (first use in this function)
/var/tmp/portage/x11-drivers/ati-drivers-8.33.6-r90/work/common/lib/modules/fglrx/build_mod/firegl_public.c:471: warning: excess elements in scalar initializer
/var/tmp/portage/x11-drivers/ati-drivers-8.33.6-r90/work/common/lib/modules/fglrx/build_mod/firegl_public.c:471: warning: (near initialization for ‘firegl_proc_list’)
/var/tmp/portage/x11-drivers/ati-drivers-8.33.6-r90/work/common/lib/modules/fglrx/build_mod/firegl_public.c:471: warning: excess elements in scalar initializer
/var/tmp/portage/x11-drivers/ati-drivers-8.33.6-r90/work/common/lib/modules/fglrx/build_mod/firegl_public.c:471: warning: (near initialization for ‘firegl_proc_list’)
/var/tmp/portage/x11-drivers/ati-drivers-8.33.6-r90/work/common/lib/modules/fglrx/build_mod/firegl_public.c:471: warning: excess elements in scalar initializer
/var/tmp/portage/x11-drivers/ati-drivers-8.33.6-r90/work/common/lib/modules/fglrx/build_mod/firegl_public.c:471: warning: (near initialization for ‘firegl_proc_list’)
/var/tmp/portage/x11-drivers/ati-drivers-8.33.6-r90/work/common/lib/modules/fglrx/build_mod/firegl_public.c:472: warning: braces around scalar initializer
/var/tmp/portage/x11-drivers/ati-drivers-8.33.6-r90/work/common/lib/modules/fglrx/build_mod/firegl_public.c:472: warning: (near initialization for ‘firegl_proc_list’)
/var/tmp/portage/x11-drivers/ati-drivers-8.33.6-r90/work/common/lib/modules/fglrx/build_mod/firegl_public.c:472: warning: initialization from incompatible pointer type
/var/tmp/portage/x11-drivers/ati-drivers-8.33.6-r90/work/common/lib/modules/fglrx/build_mod/firegl_public.c:472: error: ‘drm_vm_info_wrap’ undeclared (first use in this function)
/var/tmp/portage/x11-drivers/ati-drivers-8.33.6-r90/work/common/lib/modules/fglrx/build_mod/firegl_public.c:472: warning: excess elements in scalar initializer
/var/tmp/portage/x11-drivers/ati-drivers-8.33.6-r90/work/common/lib/modules/fglrx/build_mod/firegl_public.c:472: warning: (near initialization for ‘firegl_proc_list’)
/var/tmp/portage/x11-drivers/ati-drivers-8.33.6-r90/work/common/lib/modules/fglrx/build_mod/firegl_public.c:472: warning: excess elements in scalar initializer
/var/tmp/portage/x11-drivers/ati-drivers-8.33.6-r90/work/common/lib/modules/fglrx/build_mod/firegl_public.c:472: warning: (near initialization for ‘firegl_proc_list’)
/var/tmp/portage/x11-drivers/ati-drivers-8.33.6-r90/work/common/lib/modules/fglrx/build_mod/firegl_public.c:472: warning: excess elements in scalar initializer
/var/tmp/portage/x11-drivers/ati-drivers-8.33.6-r90/work/common/lib/modules/fglrx/build_mod/firegl_public.c:472: warning: (near initialization for ‘firegl_proc_list’)
/var/tmp/portage/x11-drivers/ati-drivers-8.33.6-r90/work/common/lib/modules/fglrx/build_mod/firegl_public.c:473: warning: braces around scalar initializer
/var/tmp/portage/x11-drivers/ati-drivers-8.33.6-r90/work/common/lib/modules/fglrx/build_mod/firegl_public.c:473: warning: (near initialization for ‘firegl_proc_list’)
/var/tmp/portage/x11-drivers/ati-drivers-8.33.6-r90/work/common/lib/modules/fglrx/build_mod/firegl_public.c:473: warning: initialization from incompatible pointer type
/var/tmp/portage/x11-drivers/ati-drivers-8.33.6-r90/work/common/lib/modules/fglrx/build_mod/firegl_public.c:473: error: ‘drm_clients_info_wrap’ undeclared (first use in this function)
/var/tmp/portage/x11-drivers/ati-drivers-8.33.6-r90/work/common/lib/modules/fglrx/build_mod/firegl_public.c:473: warning: excess elements in scalar initializer
/var/tmp/portage/x11-drivers/ati-drivers-8.33.6-r90/work/common/lib/modules/fglrx/build_mod/firegl_public.c:473: warning: (near initialization for ‘firegl_proc_list’)
/var/tmp/portage/x11-drivers/ati-drivers-8.33.6-r90/work/common/lib/modules/fglrx/build_mod/firegl_public.c:473: warning: excess elements in scalar initializer
/var/tmp/portage/x11-drivers/ati-drivers-8.33.6-r90/work/common/lib/modules/fglrx/build_mod/firegl_public.c:473: warning: (near initialization for ‘firegl_proc_list’)
/var/tmp/portage/x11-drivers/ati-drivers-8.33.6-r90/work/common/lib/modules/fglrx/build_mod/firegl_public.c:473: warning: excess elements in scalar initializer
/var/tmp/portage/x11-drivers/ati-drivers-8.33.6-r90/work/common/lib/modules/fglrx/build_mod/firegl_public.c:473: warning: (near initialization for ‘firegl_proc_list’)
/var/tmp/portage/x11-drivers/ati-drivers-8.33.6-r90/work/common/lib/modules/fglrx/build_mod/firegl_public.c:474: warning: braces around scalar initializer
/var/tmp/portage/x11-drivers/ati-drivers-8.33.6-r90/work/common/lib/modules/fglrx/build_mod/firegl_public.c:474: warning: (near initialization for ‘firegl_proc_list’)
/var/tmp/portage/x11-drivers/ati-drivers-8.33.6-r90/work/common/lib/modules/fglrx/build_mod/firegl_public.c:474: warning: initialization from incompatible pointer type
/var/tmp/portage/x11-drivers/ati-drivers-8.33.6-r90/work/common/lib/modules/fglrx/build_mod/firegl_public.c:474: error: ‘firegl_lock_info_wrap’ undeclared (first use in this function)
/var/tmp/portage/x11-drivers/ati-drivers-8.33.6-r90/work/common/lib/modules/fglrx/build_mod/firegl_public.c:474: warning: excess elements in scalar initializer
/var/tmp/portage/x11-drivers/ati-drivers-8.33.6-r90/work/common/lib/modules/fglrx/build_mod/firegl_public.c:474: warning: (near initialization for ‘firegl_proc_list’)
/var/tmp/portage/x11-drivers/ati-drivers-8.33.6-r90/work/common/lib/modules/fglrx/build_mod/firegl_public.c:474: warning: excess elements in scalar initializer
/var/tmp/portage/x11-drivers/ati-drivers-8.33.6-r90/work/common/lib/modules/fglrx/build_mod/firegl_public.c:474: warning: (near initialization for ‘firegl_proc_list’)
/var/tmp/portage/x11-drivers/ati-drivers-8.33.6-r90/work/common/lib/modules/fglrx/build_mod/firegl_public.c:474: warning: excess elements in scalar initializer
/var/tmp/portage/x11-drivers/ati-drivers-8.33.6-r90/work/common/lib/modules/fglrx/build_mod/firegl_public.c:474: warning: (near initialization for ‘firegl_proc_list’)
/var/tmp/portage/x11-drivers/ati-drivers-8.33.6-r90/work/common/lib/modules/fglrx/build_mod/firegl_public.c:475: warning: braces around scalar initializer
/var/tmp/portage/x11-drivers/ati-drivers-8.33.6-r90/work/common/lib/modules/fglrx/build_mod/firegl_public.c:475: warning: (near initialization for ‘firegl_proc_list’)
/var/tmp/portage/x11-drivers/ati-drivers-8.33.6-r90/work/common/lib/modules/fglrx/build_mod/firegl_public.c:475: warning: initialization from incompatible pointer type
/var/tmp/portage/x11-drivers/ati-drivers-8.33.6-r90/work/common/lib/modules/fglrx/build_mod/firegl_public.c:475: error: ‘firegl_umm_info_wrap’ undeclared (first use in this function)
/var/tmp/portage/x11-drivers/ati-drivers-8.33.6-r90/work/common/lib/modules/fglrx/build_mod/firegl_public.c:475: warning: excess elements in scalar initializer
/var/tmp/portage/x11-drivers/ati-drivers-8.33.6-r90/work/common/lib/modules/fglrx/build_mod/firegl_public.c:475: warning: (near initialization for ‘firegl_proc_list’)
/var/tmp/portage/x11-drivers/ati-drivers-8.33.6-r90/work/common/lib/modules/fglrx/build_mod/firegl_public.c:475: warning: excess elements in scalar initializer
/var/tmp/portage/x11-drivers/ati-drivers-8.33.6-r90/work/common/lib/modules/fglrx/build_mod/firegl_public.c:475: warning: (near initialization for ‘firegl_proc_list’)
/var/tmp/portage/x11-drivers/ati-drivers-8.33.6-r90/work/common/lib/modules/fglrx/build_mod/firegl_public.c:475: warning: excess elements in scalar initializer
/var/tmp/portage/x11-drivers/ati-drivers-8.33.6-r90/work/common/lib/modules/fglrx/build_mod/firegl_public.c:475: warning: (near initialization for ‘firegl_proc_list’)
/var/tmp/portage/x11-drivers/ati-drivers-8.33.6-r90/work/common/lib/modules/fglrx/build_mod/firegl_public.c:480: warning: braces around scalar initializer
/var/tmp/portage/x11-drivers/ati-drivers-8.33.6-r90/work/common/lib/modules/fglrx/build_mod/firegl_public.c:480: warning: (near initialization for ‘firegl_proc_list’)
/var/tmp/portage/x11-drivers/ati-drivers-8.33.6-r90/work/common/lib/modules/fglrx/build_mod/firegl_public.c:480: warning: initialization from incompatible pointer type
/var/tmp/portage/x11-drivers/ati-drivers-8.33.6-r90/work/common/lib/modules/fglrx/build_mod/firegl_public.c:480: error: ‘firegl_bios_version_wrap’ undeclared (first use in this function)
/var/tmp/portage/x11-drivers/ati-drivers-8.33.6-r90/work/common/lib/modules/fglrx/build_mod/firegl_public.c:480: warning: excess elements in scalar initializer
/var/tmp/portage/x11-drivers/ati-drivers-8.33.6-r90/work/common/lib/modules/fglrx/build_mod/firegl_public.c:480: warning: (near initialization for ‘firegl_proc_list’)
/var/tmp/portage/x11-drivers/ati-drivers-8.33.6-r90/work/common/lib/modules/fglrx/build_mod/firegl_public.c:480: warning: excess elements in scalar initializer
/var/tmp/portage/x11-drivers/ati-drivers-8.33.6-r90/work/common/lib/modules/fglrx/build_mod/firegl_public.c:480: warning: (near initialization for ‘firegl_proc_list’)
/var/tmp/portage/x11-drivers/ati-drivers-8.33.6-r90/work/common/lib/modules/fglrx/build_mod/firegl_public.c:480: warning: excess elements in scalar initializer
/var/tmp/portage/x11-drivers/ati-drivers-8.33.6-r90/work/common/lib/modules/fglrx/build_mod/firegl_public.c:480: warning: (near initialization for ‘firegl_proc_list’)
/var/tmp/portage/x11-drivers/ati-drivers-8.33.6-r90/work/common/lib/modules/fglrx/build_mod/firegl_public.c:481: warning: braces around scalar initializer
/var/tmp/portage/x11-drivers/ati-drivers-8.33.6-r90/work/common/lib/modules/fglrx/build_mod/firegl_public.c:481: warning: (near initialization for ‘firegl_proc_list’)
/var/tmp/portage/x11-drivers/ati-drivers-8.33.6-r90/work/common/lib/modules/fglrx/build_mod/firegl_public.c:481: warning: initialization from incompatible pointer type
/var/tmp/portage/x11-drivers/ati-drivers-8.33.6-r90/work/common/lib/modules/fglrx/build_mod/firegl_public.c:481: warning: excess elements in scalar initializer
/var/tmp/portage/x11-drivers/ati-drivers-8.33.6-r90/work/common/lib/modules/fglrx/build_mod/firegl_public.c:481: warning: (near initialization for ‘firegl_proc_list’)
/var/tmp/portage/x11-drivers/ati-drivers-8.33.6-r90/work/common/lib/modules/fglrx/build_mod/firegl_public.c:481: warning: excess elements in scalar initializer
/var/tmp/portage/x11-drivers/ati-drivers-8.33.6-r90/work/common/lib/modules/fglrx/build_mod/firegl_public.c:481: warning: (near initialization for ‘firegl_proc_list’)
/var/tmp/portage/x11-drivers/ati-drivers-8.33.6-r90/work/common/lib/modules/fglrx/build_mod/firegl_public.c:481: warning: excess elements in scalar initializer
/var/tmp/portage/x11-drivers/ati-drivers-8.33.6-r90/work/common/lib/modules/fglrx/build_mod/firegl_public.c:481: warning: (near initialization for ‘firegl_proc_list’)
/var/tmp/portage/x11-drivers/ati-drivers-8.33.6-r90/work/common/lib/modules/fglrx/build_mod/firegl_public.c:482: warning: braces around scalar initializer
/var/tmp/portage/x11-drivers/ati-drivers-8.33.6-r90/work/common/lib/modules/fglrx/build_mod/firegl_public.c:482: warning: (near initialization for ‘firegl_proc_list’)
/var/tmp/portage/x11-drivers/ati-drivers-8.33.6-r90/work/common/lib/modules/fglrx/build_mod/firegl_public.c:482: warning: initialization from incompatible pointer type
/var/tmp/portage/x11-drivers/ati-drivers-8.33.6-r90/work/common/lib/modules/fglrx/build_mod/firegl_public.c:482: warning: excess elements in scalar initializer
/var/tmp/portage/x11-drivers/ati-drivers-8.33.6-r90/work/common/lib/modules/fglrx/build_mod/firegl_public.c:482: warning: (near initialization for ‘firegl_proc_list’)
/var/tmp/portage/x11-drivers/ati-drivers-8.33.6-r90/work/common/lib/modules/fglrx/build_mod/firegl_public.c:482: warning: excess elements in scalar initializer
/var/tmp/portage/x11-drivers/ati-drivers-8.33.6-r90/work/common/lib/modules/fglrx/build_mod/firegl_public.c:482: warning: (near initialization for ‘firegl_proc_list’)
/var/tmp/portage/x11-drivers/ati-drivers-8.33.6-r90/work/common/lib/modules/fglrx/build_mod/firegl_public.c:482: warning: excess elements in scalar initializer
/var/tmp/portage/x11-drivers/ati-drivers-8.33.6-r90/work/common/lib/modules/fglrx/build_mod/firegl_public.c:482: warning: (near initialization for ‘firegl_proc_list’)
/var/tmp/portage/x11-drivers/ati-drivers-8.33.6-r90/work/common/lib/modules/fglrx/build_mod/firegl_public.c:485: error: expected ‘)’ before ‘*’ token
/var/tmp/portage/x11-drivers/ati-drivers-8.33.6-r90/work/common/lib/modules/fglrx/build_mod/firegl_public.c:550: error: expected ‘=’, ‘,’, ‘;’, ‘asm’ or ‘__attribute__’ before ‘{’ token
/var/tmp/portage/x11-drivers/ati-drivers-8.33.6-r90/work/common/lib/modules/fglrx/build_mod/firegl_public.c:574: error: expected ‘=’, ‘,’, ‘;’, ‘asm’ or ‘__attribute__’ before ‘{’ token
/var/tmp/portage/x11-drivers/ati-drivers-8.33.6-r90/work/common/lib/modules/fglrx/build_mod/firegl_public.c:598: error: storage class specified for parameter ‘firegl_stub_fops’
/var/tmp/portage/x11-drivers/ati-drivers-8.33.6-r90/work/common/lib/modules/fglrx/build_mod/firegl_public.c:598: error: parameter ‘firegl_stub_fops’ is initialized
/var/tmp/portage/x11-drivers/ati-drivers-8.33.6-r90/work/common/lib/modules/fglrx/build_mod/firegl_public.c:600: error: ‘firegl_stub_open’ undeclared (first use in this function)
/var/tmp/portage/x11-drivers/ati-drivers-8.33.6-r90/work/common/lib/modules/fglrx/build_mod/firegl_public.c:603: error: expected declaration specifiers or ‘...’ before ‘device_t’
/var/tmp/portage/x11-drivers/ati-drivers-8.33.6-r90/work/common/lib/modules/fglrx/build_mod/firegl_public.c:604: error: expected ‘=’, ‘,’, ‘;’, ‘asm’ or ‘__attribute__’ before ‘{’ token
/var/tmp/portage/x11-drivers/ati-drivers-8.33.6-r90/work/common/lib/modules/fglrx/build_mod/firegl_public.c:623: error: expected ‘=’, ‘,’, ‘;’, ‘asm’ or ‘__attribute__’ before ‘{’ token
/var/tmp/portage/x11-drivers/ati-drivers-8.33.6-r90/work/common/lib/modules/fglrx/build_mod/firegl_public.c:640: error: expected declaration specifiers or ‘...’ before ‘device_t’
/var/tmp/portage/x11-drivers/ati-drivers-8.33.6-r90/work/common/lib/modules/fglrx/build_mod/firegl_public.c:641: error: expected ‘=’, ‘,’, ‘;’, ‘asm’ or ‘__attribute__’ before ‘{’ token
/var/tmp/portage/x11-drivers/ati-drivers-8.33.6-r90/work/common/lib/modules/fglrx/build_mod/firegl_public.c:675: error: expected ‘=’, ‘,’, ‘;’, ‘asm’ or ‘__attribute__’ before ‘{’ token
/var/tmp/portage/x11-drivers/ati-drivers-8.33.6-r90/work/common/lib/modules/fglrx/build_mod/firegl_public.c:684: error: storage class specified for parameter ‘fglrx_pci_table’
/var/tmp/portage/x11-drivers/ati-drivers-8.33.6-r90/work/common/lib/modules/fglrx/build_mod/firegl_public.c:684: error: parameter ‘fglrx_pci_table’ is initialized
/var/tmp/portage/x11-drivers/ati-drivers-8.33.6-r90/work/common/lib/modules/fglrx/build_mod/firegl_public.c:686: warning: braces around scalar initializer
/var/tmp/portage/x11-drivers/ati-drivers-8.33.6-r90/work/common/lib/modules/fglrx/build_mod/firegl_public.c:686: warning: (near initialization for ‘fglrx_pci_table’)
/var/tmp/portage/x11-drivers/ati-drivers-8.33.6-r90/work/common/lib/modules/fglrx/build_mod/firegl_public.c:687: error: field name not in record or union initializer
/var/tmp/portage/x11-drivers/ati-drivers-8.33.6-r90/work/common/lib/modules/fglrx/build_mod/firegl_public.c:687: error: (near initialization for ‘fglrx_pci_table’)
/var/tmp/portage/x11-drivers/ati-drivers-8.33.6-r90/work/common/lib/modules/fglrx/build_mod/firegl_public.c:687: warning: initialization makes pointer from integer without a cast
/var/tmp/portage/x11-drivers/ati-drivers-8.33.6-r90/work/common/lib/modules/fglrx/build_mod/firegl_public.c:688: error: field name not in record or union initializer
/var/tmp/portage/x11-drivers/ati-drivers-8.33.6-r90/work/common/lib/modules/fglrx/build_mod/firegl_public.c:688: error: (near initialization for ‘fglrx_pci_table’)
/var/tmp/portage/x11-drivers/ati-drivers-8.33.6-r90/work/common/lib/modules/fglrx/build_mod/firegl_public.c:688: warning: excess elements in scalar initializer
/var/tmp/portage/x11-drivers/ati-drivers-8.33.6-r90/work/common/lib/modules/fglrx/build_mod/firegl_public.c:688: warning: (near initialization for ‘fglrx_pci_table’)
/var/tmp/portage/x11-drivers/ati-drivers-8.33.6-r90/work/common/lib/modules/fglrx/build_mod/firegl_public.c:689: error: field name not in record or union initializer
/var/tmp/portage/x11-drivers/ati-drivers-8.33.6-r90/work/common/lib/modules/fglrx/build_mod/firegl_public.c:689: error: (near initialization for ‘fglrx_pci_table’)
/var/tmp/portage/x11-drivers/ati-drivers-8.33.6-r90/work/common/lib/modules/fglrx/build_mod/firegl_public.c:689: warning: excess elements in scalar initializer
/var/tmp/portage/x11-drivers/ati-drivers-8.33.6-r90/work/common/lib/modules/fglrx/build_mod/firegl_public.c:689: warning: (near initialization for ‘fglrx_pci_table’)
/var/tmp/portage/x11-drivers/ati-drivers-8.33.6-r90/work/common/lib/modules/fglrx/build_mod/firegl_public.c:690: error: field name not in record or union initializer
/var/tmp/portage/x11-drivers/ati-drivers-8.33.6-r90/work/common/lib/modules/fglrx/build_mod/firegl_public.c:690: error: (near initialization for ‘fglrx_pci_table’)
/var/tmp/portage/x11-drivers/ati-drivers-8.33.6-r90/work/common/lib/modules/fglrx/build_mod/firegl_public.c:690: warning: excess elements in scalar initializer
/var/tmp/portage/x11-drivers/ati-drivers-8.33.6-r90/work/common/lib/modules/fglrx/build_mod/firegl_public.c:690: warning: (near initialization for ‘fglrx_pci_table’)
/var/tmp/portage/x11-drivers/ati-drivers-8.33.6-r90/work/common/lib/modules/fglrx/build_mod/firegl_public.c:691: error: field name not in record or union initializer
/var/tmp/portage/x11-drivers/ati-drivers-8.33.6-r90/work/common/lib/modules/fglrx/build_mod/firegl_public.c:691: error: (near initialization for ‘fglrx_pci_table’)
/var/tmp/portage/x11-drivers/ati-drivers-8.33.6-r90/work/common/lib/modules/fglrx/build_mod/firegl_public.c:691: warning: excess elements in scalar initializer
/var/tmp/portage/x11-drivers/ati-drivers-8.33.6-r90/work/common/lib/modules/fglrx/build_mod/firegl_public.c:691: warning: (near initialization for ‘fglrx_pci_table’)
/var/tmp/portage/x11-drivers/ati-drivers-8.33.6-r90/work/common/lib/modules/fglrx/build_mod/firegl_public.c:692: error: field name not in record or union initializer
/var/tmp/portage/x11-drivers/ati-drivers-8.33.6-r90/work/common/lib/modules/fglrx/build_mod/firegl_public.c:692: error: (near initialization for ‘fglrx_pci_table’)
/var/tmp/portage/x11-drivers/ati-drivers-8.33.6-r90/work/common/lib/modules/fglrx/build_mod/firegl_public.c:692: warning: excess elements in scalar initializer
/var/tmp/portage/x11-drivers/ati-drivers-8.33.6-r90/work/common/lib/modules/fglrx/build_mod/firegl_public.c:692: warning: (near initialization for ‘fglrx_pci_table’)
/var/tmp/portage/x11-drivers/ati-drivers-8.33.6-r90/work/common/lib/modules/fglrx/build_mod/firegl_public.c:694: warning: braces around scalar initializer
/var/tmp/portage/x11-drivers/ati-drivers-8.33.6-r90/work/common/lib/modules/fglrx/build_mod/firegl_public.c:694: warning: (near initialization for ‘fglrx_pci_table’)
/var/tmp/portage/x11-drivers/ati-drivers-8.33.6-r90/work/common/lib/modules/fglrx/build_mod/firegl_public.c:694: warning: excess elements in scalar initializer
/var/tmp/portage/x11-drivers/ati-drivers-8.33.6-r90/work/common/lib/modules/fglrx/build_mod/firegl_public.c:694: warning: (near initialization for ‘fglrx_pci_table’)
/var/tmp/portage/x11-drivers/ati-drivers-8.33.6-r90/work/common/lib/modules/fglrx/build_mod/firegl_public.c:698: error: expected ‘=’, ‘,’, ‘;’, ‘asm’ or ‘__attribute__’ before ‘{’ token
/var/tmp/portage/x11-drivers/ati-drivers-8.33.6-r90/work/common/lib/modules/fglrx/build_mod/firegl_public.c:712: error: expected ‘=’, ‘,’, ‘;’, ‘asm’ or ‘__attribute__’ before ‘{’ token
/var/tmp/portage/x11-drivers/ati-drivers-8.33.6-r90/work/common/lib/modules/fglrx/build_mod/firegl_public.c:746: error: expected ‘=’, ‘,’, ‘;’, ‘asm’ or ‘__attribute__’ before ‘{’ token
/var/tmp/portage/x11-drivers/ati-drivers-8.33.6-r90/work/common/lib/modules/fglrx/build_mod/firegl_public.c:780: error: storage class specified for parameter ‘fglrx_pci_driver’
/var/tmp/portage/x11-drivers/ati-drivers-8.33.6-r90/work/common/lib/modules/fglrx/build_mod/firegl_public.c:780: error: parameter ‘fglrx_pci_driver’ is initialized
/var/tmp/portage/x11-drivers/ati-drivers-8.33.6-r90/work/common/lib/modules/fglrx/build_mod/firegl_public.c:784: error: ‘fglrx_pci_probe’ undeclared (first use in this function)
/var/tmp/portage/x11-drivers/ati-drivers-8.33.6-r90/work/common/lib/modules/fglrx/build_mod/firegl_public.c:786: error: ‘fglrx_pci_suspend’ undeclared (first use in this function)
/var/tmp/portage/x11-drivers/ati-drivers-8.33.6-r90/work/common/lib/modules/fglrx/build_mod/firegl_public.c:787: error: ‘fglrx_pci_resume’ undeclared (first use in this function)
/var/tmp/portage/x11-drivers/ati-drivers-8.33.6-r90/work/common/lib/modules/fglrx/build_mod/firegl_public.c:796: error: expected ‘=’, ‘,’, ‘;’, ‘asm’ or ‘__attribute__’ before ‘{’ token
/var/tmp/portage/x11-drivers/ati-drivers-8.33.6-r90/work/common/lib/modules/fglrx/build_mod/firegl_public.c:885: error: expected ‘=’, ‘,’, ‘;’, ‘asm’ or ‘__attribute__’ before ‘{’ token
/var/tmp/portage/x11-drivers/ati-drivers-8.33.6-r90/work/common/lib/modules/fglrx/build_mod/firegl_public.c:915: error: expected ‘=’, ‘,’, ‘;’, ‘asm’ or ‘__attribute__’ before ‘{’ token
/var/tmp/portage/x11-drivers/ati-drivers-8.33.6-r90/work/common/lib/modules/fglrx/build_mod/firegl_public.c:915: error: ‘init_module’ defined both normally and as an alias
/var/tmp/portage/x11-drivers/ati-drivers-8.33.6-r90/work/common/lib/modules/fglrx/build_mod/firegl_public.c:915: error: expected declaration specifiers before ‘;’ token
/var/tmp/portage/x11-drivers/ati-drivers-8.33.6-r90/work/common/lib/modules/fglrx/build_mod/firegl_public.c:916: error: expected ‘=’, ‘,’, ‘;’, ‘asm’ or ‘__attribute__’ before ‘{’ token
/var/tmp/portage/x11-drivers/ati-drivers-8.33.6-r90/work/common/lib/modules/fglrx/build_mod/firegl_public.c:916: error: ‘cleanup_module’ defined both normally and as an alias
/var/tmp/portage/x11-drivers/ati-drivers-8.33.6-r90/work/common/lib/modules/fglrx/build_mod/firegl_public.c:916: error: expected declaration specifiers before ‘;’ token
/var/tmp/portage/x11-drivers/ati-drivers-8.33.6-r90/work/common/lib/modules/fglrx/build_mod/firegl_public.c:922: error: expected ‘=’, ‘,’, ‘;’, ‘asm’ or ‘__attribute__’ before ‘{’ token
/var/tmp/portage/x11-drivers/ati-drivers-8.33.6-r90/work/common/lib/modules/fglrx/build_mod/firegl_public.c:935: error: expected ‘=’, ‘,’, ‘;’, ‘asm’ or ‘__attribute__’ before ‘{’ token
/var/tmp/portage/x11-drivers/ati-drivers-8.33.6-r90/work/common/lib/modules/fglrx/build_mod/firegl_public.c:941: error: expected ‘=’, ‘,’, ‘;’, ‘asm’ or ‘__attribute__’ before ‘{’ token
/var/tmp/portage/x11-drivers/ati-drivers-8.33.6-r90/work/common/lib/modules/fglrx/build_mod/firegl_public.c:949: error: expected ‘=’, ‘,’, ‘;’, ‘asm’ or ‘__attribute__’ before ‘{’ token
/var/tmp/portage/x11-drivers/ati-drivers-8.33.6-r90/work/common/lib/modules/fglrx/build_mod/firegl_public.c:955: error: expected ‘=’, ‘,’, ‘;’, ‘asm’ or ‘__attribute__’ before ‘{’ token
/var/tmp/portage/x11-drivers/ati-drivers-8.33.6-r90/work/common/lib/modules/fglrx/build_mod/firegl_public.c:960: error: expected ‘=’, ‘,’, ‘;’, ‘asm’ or ‘__attribute__’ before ‘{’ token
/var/tmp/portage/x11-drivers/ati-drivers-8.33.6-r90/work/common/lib/modules/fglrx/build_mod/firegl_public.c:984: error: expected ‘=’, ‘,’, ‘;’, ‘asm’ or ‘__attribute__’ before ‘{’ token
/var/tmp/portage/x11-drivers/ati-drivers-8.33.6-r90/work/common/lib/modules/fglrx/build_mod/firegl_public.c:991: error: expected ‘=’, ‘,’, ‘;’, ‘asm’ or ‘__attribute__’ before ‘{’ token
/var/tmp/portage/x11-drivers/ati-drivers-8.33.6-r90/work/common/lib/modules/fglrx/build_mod/firegl_public.c:996: error: expected ‘=’, ‘,’, ‘;’, ‘asm’ or ‘__attribute__’ before ‘{’ token
/var/tmp/portage/x11-drivers/ati-drivers-8.33.6-r90/work/common/lib/modules/fglrx/build_mod/firegl_public.c:1001: error: expected ‘=’, ‘,’, ‘;’, ‘asm’ or ‘__attribute__’ before ‘{’ token
/var/tmp/portage/x11-drivers/ati-drivers-8.33.6-r90/work/common/lib/modules/fglrx/build_mod/firegl_public.c:1007: error: expected ‘=’, ‘,’, ‘;’, ‘asm’ or ‘__attribute__’ before ‘{’ token
/var/tmp/portage/x11-drivers/ati-drivers-8.33.6-r90/work/common/lib/modules/fglrx/build_mod/firegl_public.c:1013: error: expected ‘=’, ‘,’, ‘;’, ‘asm’ or ‘__attribute__’ before ‘{’ token
/var/tmp/portage/x11-drivers/ati-drivers-8.33.6-r90/work/common/lib/modules/fglrx/build_mod/firegl_public.c:1019: error: expected ‘=’, ‘,’, ‘;’, ‘asm’ or ‘__attribute__’ before ‘{’ token
/var/tmp/portage/x11-drivers/ati-drivers-8.33.6-r90/work/common/lib/modules/fglrx/build_mod/firegl_public.c:1024: error: expected ‘=’, ‘,’, ‘;’, ‘asm’ or ‘__attribute__’ before ‘{’ token
/var/tmp/portage/x11-drivers/ati-drivers-8.33.6-r90/work/common/lib/modules/fglrx/build_mod/firegl_public.c:1029: error: expected ‘=’, ‘,’, ‘;’, ‘asm’ or ‘__attribute__’ before ‘{’ token
/var/tmp/portage/x11-drivers/ati-drivers-8.33.6-r90/work/common/lib/modules/fglrx/build_mod/firegl_public.c:1034: error: expected ‘=’, ‘,’, ‘;’, ‘asm’ or ‘__attribute__’ before ‘{’ token
/var/tmp/portage/x11-drivers/ati-drivers-8.33.6-r90/work/common/lib/modules/fglrx/build_mod/firegl_public.c:1044: error: expected ‘=’, ‘,’, ‘;’, ‘asm’ or ‘__attribute__’ before ‘{’ token
/var/tmp/portage/x11-drivers/ati-drivers-8.33.6-r90/work/common/lib/modules/fglrx/build_mod/firegl_public.c:1049: error: expected ‘=’, ‘,’, ‘;’, ‘asm’ or ‘__attribute__’ before ‘{’ token
/var/tmp/portage/x11-drivers/ati-drivers-8.33.6-r90/work/common/lib/modules/fglrx/build_mod/firegl_public.c:1054: error: expected ‘=’, ‘,’, ‘;’, ‘asm’ or ‘__attribute__’ before ‘{’ token
/var/tmp/portage/x11-drivers/ati-drivers-8.33.6-r90/work/common/lib/modules/fglrx/build_mod/firegl_public.c:1095: error: expected ‘=’, ‘,’, ‘;’, ‘asm’ or ‘__attribute__’ before ‘{’ token
/var/tmp/portage/x11-drivers/ati-drivers-8.33.6-r90/work/common/lib/modules/fglrx/build_mod/firegl_public.c:1107: error: expected ‘=’, ‘,’, ‘;’, ‘asm’ or ‘__attribute__’ before ‘{’ token
/var/tmp/portage/x11-drivers/ati-drivers-8.33.6-r90/work/common/lib/modules/fglrx/build_mod/firegl_public.c:1112: error: expected ‘=’, ‘,’, ‘;’, ‘asm’ or ‘__attribute__’ before ‘{’ token
/var/tmp/portage/x11-drivers/ati-drivers-8.33.6-r90/work/common/lib/modules/fglrx/build_mod/firegl_public.c:1119: error: expected ‘=’, ‘,’, ‘;’, ‘asm’ or ‘__attribute__’ before ‘{’ token
/var/tmp/portage/x11-drivers/ati-drivers-8.33.6-r90/work/common/lib/modules/fglrx/build_mod/firegl_public.c:1130: error: expected ‘=’, ‘,’, ‘;’, ‘asm’ or ‘__attribute__’ before ‘{’ token
/var/tmp/portage/x11-drivers/ati-drivers-8.33.6-r90/work/common/lib/modules/fglrx/build_mod/firegl_public.c:1135: error: expected ‘=’, ‘,’, ‘;’, ‘asm’ or ‘__attribute__’ before ‘{’ token
/var/tmp/portage/x11-drivers/ati-drivers-8.33.6-r90/work/common/lib/modules/fglrx/build_mod/firegl_public.c:1144: error: expected ‘=’, ‘,’, ‘;’, ‘asm’ or ‘__attribute__’ before ‘{’ token
/var/tmp/portage/x11-drivers/ati-drivers-8.33.6-r90/work/common/lib/modules/fglrx/build_mod/firegl_public.c:1149: error: expected ‘=’, ‘,’, ‘;’, ‘asm’ or ‘__attribute__’ before ‘{’ token
/var/tmp/portage/x11-drivers/ati-drivers-8.33.6-r90/work/common/lib/modules/fglrx/build_mod/firegl_public.c:1154: error: expected ‘=’, ‘,’, ‘;’, ‘asm’ or ‘__attribute__’ before ‘{’ token
/var/tmp/portage/x11-drivers/ati-drivers-8.33.6-r90/work/common/lib/modules/fglrx/build_mod/firegl_public.c:1159: error: expected ‘=’, ‘,’, ‘;’, ‘asm’ or ‘__attribute__’ before ‘{’ token
/var/tmp/portage/x11-drivers/ati-drivers-8.33.6-r90/work/common/lib/modules/fglrx/build_mod/firegl_public.c:1164: error: expected ‘=’, ‘,’, ‘;’, ‘asm’ or ‘__attribute__’ before ‘{’ token
/var/tmp/portage/x11-drivers/ati-drivers-8.33.6-r90/work/common/lib/modules/fglrx/build_mod/firegl_public.c:1169: error: expected ‘=’, ‘,’, ‘;’, ‘asm’ or ‘__attribute__’ before ‘{’ token
/var/tmp/portage/x11-drivers/ati-drivers-8.33.6-r90/work/common/lib/modules/fglrx/build_mod/firegl_public.c:1176: error: expected ‘=’, ‘,’, ‘;’, ‘asm’ or ‘__attribute__’ before ‘{’ token
/var/tmp/portage/x11-drivers/ati-drivers-8.33.6-r90/work/common/lib/modules/fglrx/build_mod/firegl_public.c:1181: error: expected ‘=’, ‘,’, ‘;’, ‘asm’ or ‘__attribute__’ before ‘{’ token
/var/tmp/portage/x11-drivers/ati-drivers-8.33.6-r90/work/common/lib/modules/fglrx/build_mod/firegl_public.c:1188: error: expected ‘=’, ‘,’, ‘;’, ‘asm’ or ‘__attribute__’ before ‘{’ token
/var/tmp/portage/x11-drivers/ati-drivers-8.33.6-r90/work/common/lib/modules/fglrx/build_mod/firegl_public.c:1193: error: expected ‘=’, ‘,’, ‘;’, ‘asm’ or ‘__attribute__’ before ‘{’ token
/var/tmp/portage/x11-drivers/ati-drivers-8.33.6-r90/work/common/lib/modules/fglrx/build_mod/firegl_public.c:1229: error: expected ‘=’, ‘,’, ‘;’, ‘asm’ or ‘__attribute__’ before ‘{’ token
/var/tmp/portage/x11-drivers/ati-drivers-8.33.6-r90/work/common/lib/modules/fglrx/build_mod/firegl_public.c:1234: error: expected ‘=’, ‘,’, ‘;’, ‘asm’ or ‘__attribute__’ before ‘{’ token
/var/tmp/portage/x11-drivers/ati-drivers-8.33.6-r90/work/common/lib/modules/fglrx/build_mod/firegl_public.c:1242: error: expected ‘=’, ‘,’, ‘;’, ‘asm’ or ‘__attribute__’ before ‘{’ token
/var/tmp/portage/x11-drivers/ati-drivers-8.33.6-r90/work/common/lib/modules/fglrx/build_mod/firegl_public.c:1247: error: expected ‘=’, ‘,’, ‘;’, ‘asm’ or ‘__attribute__’ before ‘{’ token
/var/tmp/portage/x11-drivers/ati-drivers-8.33.6-r90/work/common/lib/modules/fglrx/build_mod/firegl_public.c:1252: error: expected ‘=’, ‘,’, ‘;’, ‘asm’ or ‘__attribute__’ before ‘{’ token
/var/tmp/portage/x11-drivers/ati-drivers-8.33.6-r90/work/common/lib/modules/fglrx/build_mod/firegl_public.c:1257: error: expected ‘=’, ‘,’, ‘;’, ‘asm’ or ‘__attribute__’ before ‘{’ token
/var/tmp/portage/x11-drivers/ati-drivers-8.33.6-r90/work/common/lib/modules/fglrx/build_mod/firegl_public.c:1266: error: expected ‘=’, ‘,’, ‘;’, ‘asm’ or ‘__attribute__’ before ‘{’ token
/var/tmp/portage/x11-drivers/ati-drivers-8.33.6-r90/work/common/lib/modules/fglrx/build_mod/firegl_public.c:1287: error: expected ‘=’, ‘,’, ‘;’, ‘asm’ or ‘__attribute__’ before ‘{’ token
/var/tmp/portage/x11-drivers/ati-drivers-8.33.6-r90/work/common/lib/modules/fglrx/build_mod/firegl_public.c:1383: error: expected ‘=’, ‘,’, ‘;’, ‘asm’ or ‘__attribute__’ before ‘{’ token
/var/tmp/portage/x11-drivers/ati-drivers-8.33.6-r90/work/common/lib/modules/fglrx/build_mod/firegl_public.c:1392: error: expected ‘=’, ‘,’, ‘;’, ‘asm’ or ‘__attribute__’ before ‘{’ token
/var/tmp/portage/x11-drivers/ati-drivers-8.33.6-r90/work/common/lib/modules/fglrx/build_mod/firegl_public.c:1403: error: expected ‘=’, ‘,’, ‘;’, ‘asm’ or ‘__attribute__’ before ‘{’ token
/var/tmp/portage/x11-drivers/ati-drivers-8.33.6-r90/work/common/lib/modules/fglrx/build_mod/firegl_public.c:1408: error: expected ‘=’, ‘,’, ‘;’, ‘asm’ or ‘__attribute__’ before ‘{’ token
/var/tmp/portage/x11-drivers/ati-drivers-8.33.6-r90/work/common/lib/modules/fglrx/build_mod/firegl_public.c:1413: error: expected ‘=’, ‘,’, ‘;’, ‘asm’ or ‘__attribute__’ before ‘{’ token
/var/tmp/portage/x11-drivers/ati-drivers-8.33.6-r90/work/common/lib/modules/fglrx/build_mod/firegl_public.c:1418: error: expected ‘=’, ‘,’, ‘;’, ‘asm’ or ‘__attribute__’ before ‘{’ token
/var/tmp/portage/x11-drivers/ati-drivers-8.33.6-r90/work/common/lib/modules/fglrx/build_mod/firegl_public.c:1423: error: expected ‘=’, ‘,’, ‘;’, ‘asm’ or ‘__attribute__’ before ‘{’ token
/var/tmp/portage/x11-drivers/ati-drivers-8.33.6-r90/work/common/lib/modules/fglrx/build_mod/firegl_public.c:1428: error: expected ‘=’, ‘,’, ‘;’, ‘asm’ or ‘__attribute__’ before ‘{’ token
/var/tmp/portage/x11-drivers/ati-drivers-8.33.6-r90/work/common/lib/modules/fglrx/build_mod/firegl_public.c:1435: error: expected ‘=’, ‘,’, ‘;’, ‘asm’ or ‘__attribute__’ before ‘{’ token
/var/tmp/portage/x11-drivers/ati-drivers-8.33.6-r90/work/common/lib/modules/fglrx/build_mod/firegl_public.c:1440: error: expected ‘=’, ‘,’, ‘;’, ‘asm’ or ‘__attribute__’ before ‘{’ token
/var/tmp/portage/x11-drivers/ati-drivers-8.33.6-r90/work/common/lib/modules/fglrx/build_mod/firegl_public.c:1445: error: expected ‘=’, ‘,’, ‘;’, ‘asm’ or ‘__attribute__’ before ‘{’ token
/var/tmp/portage/x11-drivers/ati-drivers-8.33.6-r90/work/common/lib/modules/fglrx/build_mod/firegl_public.c:1450: error: expected ‘=’, ‘,’, ‘;’, ‘asm’ or ‘__attribute__’ before ‘{’ token
/var/tmp/portage/x11-drivers/ati-drivers-8.33.6-r90/work/common/lib/modules/fglrx/build_mod/firegl_public.c:1455: error: expected ‘=’, ‘,’, ‘;’, ‘asm’ or ‘__attribute__’ before ‘{’ token
/var/tmp/portage/x11-drivers/ati-drivers-8.33.6-r90/work/common/lib/modules/fglrx/build_mod/firegl_public.c:1460: error: expected ‘=’, ‘,’, ‘;’, ‘asm’ or ‘__attribute__’ before ‘{’ token
/var/tmp/portage/x11-drivers/ati-drivers-8.33.6-r90/work/common/lib/modules/fglrx/build_mod/firegl_public.c:1465: error: expected ‘=’, ‘,’, ‘;’, ‘asm’ or ‘__attribute__’ before ‘{’ token
/var/tmp/portage/x11-drivers/ati-drivers-8.33.6-r90/work/common/lib/modules/fglrx/build_mod/firegl_public.c:1472: error: expected ‘=’, ‘,’, ‘;’, ‘asm’ or ‘__attribute__’ before ‘{’ token
/var/tmp/portage/x11-drivers/ati-drivers-8.33.6-r90/work/common/lib/modules/fglrx/build_mod/firegl_public.c:1477: error: expected ‘=’, ‘,’, ‘;’, ‘asm’ or ‘__attribute__’ before ‘{’ token
/var/tmp/portage/x11-drivers/ati-drivers-8.33.6-r90/work/common/lib/modules/fglrx/build_mod/firegl_public.c:1482: error: expected ‘=’, ‘,’, ‘;’, ‘asm’ or ‘__attribute__’ before ‘{’ token
/var/tmp/portage/x11-drivers/ati-drivers-8.33.6-r90/work/common/lib/modules/fglrx/build_mod/firegl_public.c:1487: error: expected ‘=’, ‘,’, ‘;’, ‘asm’ or ‘__attribute__’ before ‘{’ token
/var/tmp/portage/x11-drivers/ati-drivers-8.33.6-r90/work/common/lib/modules/fglrx/build_mod/firegl_public.c:1497: error: storage class specified for parameter ‘PFNMLOCK’
/var/tmp/portage/x11-drivers/ati-drivers-8.33.6-r90/work/common/lib/modules/fglrx/build_mod/firegl_public.c:1498: error: storage class specified for parameter ‘PFNMUNLOCK’
/var/tmp/portage/x11-drivers/ati-drivers-8.33.6-r90/work/common/lib/modules/fglrx/build_mod/firegl_public.c:1502: error: expected ‘=’, ‘,’, ‘;’, ‘asm’ or ‘__attribute__’ before ‘{’ token
/var/tmp/portage/x11-drivers/ati-drivers-8.33.6-r90/work/common/lib/modules/fglrx/build_mod/firegl_public.c:1517: error: expected ‘=’, ‘,’, ‘;’, ‘asm’ or ‘__attribute__’ before ‘{’ token
/var/tmp/portage/x11-drivers/ati-drivers-8.33.6-r90/work/common/lib/modules/fglrx/build_mod/firegl_public.c:1532: error: storage class specified for parameter ‘PFNMODIFYLDT’
/var/tmp/portage/x11-drivers/ati-drivers-8.33.6-r90/work/common/lib/modules/fglrx/build_mod/firegl_public.c:1535: error: expected ‘=’, ‘,’, ‘;’, ‘asm’ or ‘__attribute__’ before ‘{’ token
/var/tmp/portage/x11-drivers/ati-drivers-8.33.6-r90/work/common/lib/modules/fglrx/build_mod/firegl_public.c:1556: error: expected ‘=’, ‘,’, ‘;’, ‘asm’ or ‘__attribute__’ before ‘{’ token
/var/tmp/portage/x11-drivers/ati-drivers-8.33.6-r90/work/common/lib/modules/fglrx/build_mod/firegl_public.c:1561: error: expected ‘=’, ‘,’, ‘;’, ‘asm’ or ‘__attribute__’ before ‘{’ token
/var/tmp/portage/x11-drivers/ati-drivers-8.33.6-r90/work/common/lib/modules/fglrx/build_mod/firegl_public.c:1568: error: expected ‘=’, ‘,’, ‘;’, ‘asm’ or ‘__attribute__’ before ‘{’ token
/var/tmp/portage/x11-drivers/ati-drivers-8.33.6-r90/work/common/lib/modules/fglrx/build_mod/firegl_public.c:1677: error: expected ‘=’, ‘,’, ‘;’, ‘asm’ or ‘__attribute__’ before ‘{’ token
/var/tmp/portage/x11-drivers/ati-drivers-8.33.6-r90/work/common/lib/modules/fglrx/build_mod/firegl_public.c:1693: error: expected ‘=’, ‘,’, ‘;’, ‘asm’ or ‘__attribute__’ before ‘{’ token
/var/tmp/portage/x11-drivers/ati-drivers-8.33.6-r90/work/common/lib/modules/fglrx/build_mod/firegl_public.c:1709: error: expected ‘=’, ‘,’, ‘;’, ‘asm’ or ‘__attribute__’ before ‘{’ token
/var/tmp/portage/x11-drivers/ati-drivers-8.33.6-r90/work/common/lib/modules/fglrx/build_mod/firegl_public.c:1714: error: expected ‘=’, ‘,’, ‘;’, ‘asm’ or ‘__attribute__’ before ‘{’ token
/var/tmp/portage/x11-drivers/ati-drivers-8.33.6-r90/work/common/lib/modules/fglrx/build_mod/firegl_public.c:1719: error: expected ‘=’, ‘,’, ‘;’, ‘asm’ or ‘__attribute__’ before ‘{’ token
/var/tmp/portage/x11-drivers/ati-drivers-8.33.6-r90/work/common/lib/modules/fglrx/build_mod/firegl_public.c:1744: error: expected ‘=’, ‘,’, ‘;’, ‘asm’ or ‘__attribute__’ before ‘{’ token
/var/tmp/portage/x11-drivers/ati-drivers-8.33.6-r90/work/common/lib/modules/fglrx/build_mod/firegl_public.c:1749: error: expected ‘=’, ‘,’, ‘;’, ‘asm’ or ‘__attribute__’ before ‘{’ token
/var/tmp/portage/x11-drivers/ati-drivers-8.33.6-r90/work/common/lib/modules/fglrx/build_mod/firegl_public.c:1754: error: expected ‘=’, ‘,’, ‘;’, ‘asm’ or ‘__attribute__’ before ‘{’ token
/var/tmp/portage/x11-drivers/ati-drivers-8.33.6-r90/work/common/lib/modules/fglrx/build_mod/firegl_public.c:1763: error: expected ‘=’, ‘,’, ‘;’, ‘asm’ or ‘__attribute__’ before ‘{’ token
/var/tmp/portage/x11-drivers/ati-drivers-8.33.6-r90/work/common/lib/modules/fglrx/build_mod/firegl_public.c:1775: error: expected ‘=’, ‘,’, ‘;’, ‘asm’ or ‘__attribute__’ before ‘{’ token
/var/tmp/portage/x11-drivers/ati-drivers-8.33.6-r90/work/common/lib/modules/fglrx/build_mod/firegl_public.c:1795: error: expected ‘=’, ‘,’, ‘;’, ‘asm’ or ‘__attribute__’ before ‘{’ token
/var/tmp/portage/x11-drivers/ati-drivers-8.33.6-r90/work/common/lib/modules/fglrx/build_mod/firegl_public.c:1806: error: expected ‘=’, ‘,’, ‘;’, ‘asm’ or ‘__attribute__’ before ‘{’ token
/var/tmp/portage/x11-drivers/ati-drivers-8.33.6-r90/work/common/lib/modules/fglrx/build_mod/firegl_public.c:1811: error: expected ‘=’, ‘,’, ‘;’, ‘asm’ or ‘__attribute__’ before ‘{’ token
/var/tmp/portage/x11-drivers/ati-drivers-8.33.6-r90/work/common/lib/modules/fglrx/build_mod/firegl_public.c:1816: error: expected ‘=’, ‘,’, ‘;’, ‘asm’ or ‘__attribute__’ before ‘{’ token
/var/tmp/portage/x11-drivers/ati-drivers-8.33.6-r90/work/common/lib/modules/fglrx/build_mod/firegl_public.c:1821: error: expected ‘=’, ‘,’, ‘;’, ‘asm’ or ‘__attribute__’ before ‘{’ token
/var/tmp/portage/x11-drivers/ati-drivers-8.33.6-r90/work/common/lib/modules/fglrx/build_mod/firegl_public.c:1826: error: expected ‘=’, ‘,’, ‘;’, ‘asm’ or ‘__attribute__’ before ‘{’ token
/var/tmp/portage/x11-drivers/ati-drivers-8.33.6-r90/work/common/lib/modules/fglrx/build_mod/firegl_public.c:1831: error: expected ‘=’, ‘,’, ‘;’, ‘asm’ or ‘__attribute__’ before ‘{’ token
/var/tmp/portage/x11-drivers/ati-drivers-8.33.6-r90/work/common/lib/modules/fglrx/build_mod/firegl_public.c:1835: error: expected ‘=’, ‘,’, ‘;’, ‘asm’ or ‘__attribute__’ before ‘{’ token
/var/tmp/portage/x11-drivers/ati-drivers-8.33.6-r90/work/common/lib/modules/fglrx/build_mod/firegl_public.c:1839: error: expected ‘=’, ‘,’, ‘;’, ‘asm’ or ‘__attribute__’ before ‘{’ token
/var/tmp/portage/x11-drivers/ati-drivers-8.33.6-r90/work/common/lib/modules/fglrx/build_mod/firegl_public.c:1844: error: expected ‘=’, ‘,’, ‘;’, ‘asm’ or ‘__attribute__’ before ‘{’ token
/var/tmp/portage/x11-drivers/ati-drivers-8.33.6-r90/work/common/lib/modules/fglrx/build_mod/firegl_public.c:1849: error: expected ‘=’, ‘,’, ‘;’, ‘asm’ or ‘__attribute__’ before ‘{’ token
/var/tmp/portage/x11-drivers/ati-drivers-8.33.6-r90/work/common/lib/modules/fglrx/build_mod/firegl_public.c:1854: error: expected ‘=’, ‘,’, ‘;’, ‘asm’ or ‘__attribute__’ before ‘{’ token
/var/tmp/portage/x11-drivers/ati-drivers-8.33.6-r90/work/common/lib/modules/fglrx/build_mod/firegl_public.c:1859: error: expected ‘=’, ‘,’, ‘;’, ‘asm’ or ‘__attribute__’ before ‘{’ token
/var/tmp/portage/x11-drivers/ati-drivers-8.33.6-r90/work/common/lib/modules/fglrx/build_mod/firegl_public.c:1864: error: expected ‘=’, ‘,’, ‘;’, ‘asm’ or ‘__attribute__’ before ‘{’ token
/var/tmp/portage/x11-drivers/ati-drivers-8.33.6-r90/work/common/lib/modules/fglrx/build_mod/firegl_public.c:1869: error: expected ‘=’, ‘,’, ‘;’, ‘asm’ or ‘__attribute__’ before ‘{’ token
/var/tmp/portage/x11-drivers/ati-drivers-8.33.6-r90/work/common/lib/modules/fglrx/build_mod/firegl_public.c:1874: error: expected ‘=’, ‘,’, ‘;’, ‘asm’ or ‘__attribute__’ before ‘{’ token
/var/tmp/portage/x11-drivers/ati-drivers-8.33.6-r90/work/common/lib/modules/fglrx/build_mod/firegl_public.c:1879: error: expected ‘=’, ‘,’, ‘;’, ‘asm’ or ‘__attribute__’ before ‘{’ token
/var/tmp/portage/x11-drivers/ati-drivers-8.33.6-r90/work/common/lib/modules/fglrx/build_mod/firegl_public.c:1884: error: expected ‘=’, ‘,’, ‘;’, ‘asm’ or ‘__attribute__’ before ‘{’ token
/var/tmp/portage/x11-drivers/ati-drivers-8.33.6-r90/work/common/lib/modules/fglrx/build_mod/firegl_public.c:1893: error: expected ‘=’, ‘,’, ‘;’, ‘asm’ or ‘__attribute__’ before ‘{’ token
/var/tmp/portage/x11-drivers/ati-drivers-8.33.6-r90/work/common/lib/modules/fglrx/build_mod/firegl_public.c:1908: error: expected ‘=’, ‘,’, ‘;’, ‘asm’ or ‘__attribute__’ before ‘{’ token
/var/tmp/portage/x11-drivers/ati-drivers-8.33.6-r90/work/common/lib/modules/fglrx/build_mod/firegl_public.c:1922: error: expected ‘=’, ‘,’, ‘;’, ‘asm’ or ‘__attribute__’ before ‘{’ token
/var/tmp/portage/x11-drivers/ati-drivers-8.33.6-r90/work/common/lib/modules/fglrx/build_mod/firegl_public.c:1942: error: expected ‘=’, ‘,’, ‘;’, ‘asm’ or ‘__attribute__’ before ‘{’ token
/var/tmp/portage/x11-drivers/ati-drivers-8.33.6-r90/work/common/lib/modules/fglrx/build_mod/firegl_public.c:1964: error: expected ‘=’, ‘,’, ‘;’, ‘asm’ or ‘__attribute__’ before ‘{’ token
/var/tmp/portage/x11-drivers/ati-drivers-8.33.6-r90/work/common/lib/modules/fglrx/build_mod/firegl_public.c:1978: error: expected ‘=’, ‘,’, ‘;’, ‘asm’ or ‘__attribute__’ before ‘{’ token
/var/tmp/portage/x11-drivers/ati-drivers-8.33.6-r90/work/common/lib/modules/fglrx/build_mod/firegl_public.c:1987: error: expected ‘=’, ‘,’, ‘;’, ‘asm’ or ‘__attribute__’ before ‘{’ token
/var/tmp/portage/x11-drivers/ati-drivers-8.33.6-r90/work/common/lib/modules/fglrx/build_mod/firegl_public.c:1996: error: expected ‘=’, ‘,’, ‘;’, ‘asm’ or ‘__attribute__’ before ‘{’ token
/var/tmp/portage/x11-drivers/ati-drivers-8.33.6-r90/work/common/lib/modules/fglrx/build_mod/firegl_public.c:2002: error: expected ‘=’, ‘,’, ‘;’, ‘asm’ or ‘__attribute__’ before ‘{’ token
/var/tmp/portage/x11-drivers/ati-drivers-8.33.6-r90/work/common/lib/modules/fglrx/build_mod/firegl_public.c:2008: error: expected ‘=’, ‘,’, ‘;’, ‘asm’ or ‘__attribute__’ before ‘{’ token
/var/tmp/portage/x11-drivers/ati-drivers-8.33.6-r90/work/common/lib/modules/fglrx/build_mod/firegl_public.c:2020: error: expected ‘=’, ‘,’, ‘;’, ‘asm’ or ‘__attribute__’ before ‘{’ token
/var/tmp/portage/x11-drivers/ati-drivers-8.33.6-r90/work/common/lib/modules/fglrx/build_mod/firegl_public.c:2025: error: expected ‘=’, ‘,’, ‘;’, ‘asm’ or ‘__attribute__’ before ‘{’ token
/var/tmp/portage/x11-drivers/ati-drivers-8.33.6-r90/work/common/lib/modules/fglrx/build_mod/firegl_public.c:2030: error: expected ‘=’, ‘,’, ‘;’, ‘asm’ or ‘__attribute__’ before ‘{’ token
/var/tmp/portage/x11-drivers/ati-drivers-8.33.6-r90/work/common/lib/modules/fglrx/build_mod/firegl_public.c:2035: error: expected ‘=’, ‘,’, ‘;’, ‘asm’ or ‘__attribute__’ before ‘{’ token
/var/tmp/portage/x11-drivers/ati-drivers-8.33.6-r90/work/common/lib/modules/fglrx/build_mod/firegl_public.c:2040: error: expected ‘=’, ‘,’, ‘;’, ‘asm’ or ‘__attribute__’ before ‘{’ token
/var/tmp/portage/x11-drivers/ati-drivers-8.33.6-r90/work/common/lib/modules/fglrx/build_mod/firegl_public.c:2045: error: expected ‘=’, ‘,’, ‘;’, ‘asm’ or ‘__attribute__’ before ‘{’ token
/var/tmp/portage/x11-drivers/ati-drivers-8.33.6-r90/work/common/lib/modules/fglrx/build_mod/firegl_public.c:2050: error: expected ‘=’, ‘,’, ‘;’, ‘asm’ or ‘__attribute__’ before ‘{’ token
/var/tmp/portage/x11-drivers/ati-drivers-8.33.6-r90/work/common/lib/modules/fglrx/build_mod/firegl_public.c:2055: error: expected ‘=’, ‘,’, ‘;’, ‘asm’ or ‘__attribute__’ before ‘{’ token
/var/tmp/portage/x11-drivers/ati-drivers-8.33.6-r90/work/common/lib/modules/fglrx/build_mod/firegl_public.c:2075: error: expected ‘=’, ‘,’, ‘;’, ‘asm’ or ‘__attribute__’ before ‘{’ token
/var/tmp/portage/x11-drivers/ati-drivers-8.33.6-r90/work/common/lib/modules/fglrx/build_mod/firegl_public.c:2107: error: expected ‘=’, ‘,’, ‘;’, ‘asm’ or ‘__attribute__’ before ‘{’ token
/var/tmp/portage/x11-drivers/ati-drivers-8.33.6-r90/work/common/lib/modules/fglrx/build_mod/firegl_public.c:2122: error: expected ‘=’, ‘,’, ‘;’, ‘asm’ or ‘__attribute__’ before ‘{’ token
/var/tmp/portage/x11-drivers/ati-drivers-8.33.6-r90/work/common/lib/modules/fglrx/build_mod/firegl_public.c:2199: error: expected ‘=’, ‘,’, ‘;’, ‘asm’ or ‘__attribute__’ before ‘{’ token
/var/tmp/portage/x11-drivers/ati-drivers-8.33.6-r90/work/common/lib/modules/fglrx/build_mod/firegl_public.c:2222: error: expected ‘=’, ‘,’, ‘;’, ‘asm’ or ‘__attribute__’ before ‘{’ token
/var/tmp/portage/x11-drivers/ati-drivers-8.33.6-r90/work/common/lib/modules/fglrx/build_mod/firegl_public.c:2227: error: expected ‘=’, ‘,’, ‘;’, ‘asm’ or ‘__attribute__’ before ‘{’ token
/var/tmp/portage/x11-drivers/ati-drivers-8.33.6-r90/work/common/lib/modules/fglrx/build_mod/firegl_public.c:2232: error: expected ‘=’, ‘,’, ‘;’, ‘asm’ or ‘__attribute__’ before ‘{’ token
/var/tmp/portage/x11-drivers/ati-drivers-8.33.6-r90/work/common/lib/modules/fglrx/build_mod/firegl_public.c:2237: error: expected ‘=’, ‘,’, ‘;’, ‘asm’ or ‘__attribute__’ before ‘{’ token
/var/tmp/portage/x11-drivers/ati-drivers-8.33.6-r90/work/common/lib/modules/fglrx/build_mod/firegl_public.c:2242: error: expected ‘=’, ‘,’, ‘;’, ‘asm’ or ‘__attribute__’ before ‘{’ token
/var/tmp/portage/x11-drivers/ati-drivers-8.33.6-r90/work/common/lib/modules/fglrx/build_mod/firegl_public.c:2247: error: expected ‘=’, ‘,’, ‘;’, ‘asm’ or ‘__attribute__’ before ‘{’ token
/var/tmp/portage/x11-drivers/ati-drivers-8.33.6-r90/work/common/lib/modules/fglrx/build_mod/firegl_public.c:2252: error: expected ‘=’, ‘,’, ‘;’, ‘asm’ or ‘__attribute__’ before ‘{’ token
/var/tmp/portage/x11-drivers/ati-drivers-8.33.6-r90/work/common/lib/modules/fglrx/build_mod/firegl_public.c:2257: error: expected ‘=’, ‘,’, ‘;’, ‘asm’ or ‘__attribute__’ before ‘{’ token
/var/tmp/portage/x11-drivers/ati-drivers-8.33.6-r90/work/common/lib/modules/fglrx/build_mod/firegl_public.c:2262: error: expected ‘=’, ‘,’, ‘;’, ‘asm’ or ‘__attribute__’ before ‘{’ token
/var/tmp/portage/x11-drivers/ati-drivers-8.33.6-r90/work/common/lib/modules/fglrx/build_mod/firegl_public.c:2273: error: expected ‘=’, ‘,’, ‘;’, ‘asm’ or ‘__attribute__’ before ‘{’ token
/var/tmp/portage/x11-drivers/ati-drivers-8.33.6-r90/work/common/lib/modules/fglrx/build_mod/firegl_public.c:2286: error: expected ‘=’, ‘,’, ‘;’, ‘asm’ or ‘__attribute__’ before ‘{’ token
/var/tmp/portage/x11-drivers/ati-drivers-8.33.6-r90/work/common/lib/modules/fglrx/build_mod/firegl_public.c:2291: error: expected ‘=’, ‘,’, ‘;’, ‘asm’ or ‘__attribute__’ before ‘{’ token
/var/tmp/portage/x11-drivers/ati-drivers-8.33.6-r90/work/common/lib/modules/fglrx/build_mod/firegl_public.c:2296: error: expected ‘=’, ‘,’, ‘;’, ‘asm’ or ‘__attribute__’ before ‘{’ token
/var/tmp/portage/x11-drivers/ati-drivers-8.33.6-r90/work/common/lib/modules/fglrx/build_mod/firegl_public.c:2301: error: expected ‘=’, ‘,’, ‘;’, ‘asm’ or ‘__attribute__’ before ‘{’ token
/var/tmp/portage/x11-drivers/ati-drivers-8.33.6-r90/work/common/lib/modules/fglrx/build_mod/firegl_public.c:2306: error: expected ‘=’, ‘,’, ‘;’, ‘asm’ or ‘__attribute__’ before ‘{’ token
/var/tmp/portage/x11-drivers/ati-drivers-8.33.6-r90/work/common/lib/modules/fglrx/build_mod/firegl_public.c:2311: error: expected ‘=’, ‘,’, ‘;’, ‘asm’ or ‘__attribute__’ before ‘{’ token
/var/tmp/portage/x11-drivers/ati-drivers-8.33.6-r90/work/common/lib/modules/fglrx/build_mod/firegl_public.c:2316: error: expected ‘=’, ‘,’, ‘;’, ‘asm’ or ‘__attribute__’ before ‘{’ token
/var/tmp/portage/x11-drivers/ati-drivers-8.33.6-r90/work/common/lib/modules/fglrx/build_mod/firegl_public.c:2341: error: expected ‘=’, ‘,’, ‘;’, ‘asm’ or ‘__attribute__’ before ‘{’ token
/var/tmp/portage/x11-drivers/ati-drivers-8.33.6-r90/work/common/lib/modules/fglrx/build_mod/firegl_public.c:2377: error: expected ‘=’, ‘,’, ‘;’, ‘asm’ or ‘__attribute__’ before ‘{’ token
/var/tmp/portage/x11-drivers/ati-drivers-8.33.6-r90/work/common/lib/modules/fglrx/build_mod/firegl_public.c:2386: error: expected ‘=’, ‘,’, ‘;’, ‘asm’ or ‘__attribute__’ before ‘{’ token
/var/tmp/portage/x11-drivers/ati-drivers-8.33.6-r90/work/common/lib/modules/fglrx/build_mod/firegl_public.c:2395: error: expected ‘=’, ‘,’, ‘;’, ‘asm’ or ‘__attribute__’ before ‘{’ token
/var/tmp/portage/x11-drivers/ati-drivers-8.33.6-r90/work/common/lib/modules/fglrx/build_mod/firegl_public.c:2404: error: expected ‘=’, ‘,’, ‘;’, ‘asm’ or ‘__attribute__’ before ‘{’ token
/var/tmp/portage/x11-drivers/ati-drivers-8.33.6-r90/work/common/lib/modules/fglrx/build_mod/firegl_public.c:2436: error: expected ‘=’, ‘,’, ‘;’, ‘asm’ or ‘__attribute__’ before ‘{’ token
/var/tmp/portage/x11-drivers/ati-drivers-8.33.6-r90/work/common/lib/modules/fglrx/build_mod/firegl_public.c:2441: error: expected ‘=’, ‘,’, ‘;’, ‘asm’ or ‘__attribute__’ before ‘{’ token
/var/tmp/portage/x11-drivers/ati-drivers-8.33.6-r90/work/common/lib/modules/fglrx/build_mod/firegl_public.c:2446: error: expected ‘=’, ‘,’, ‘;’, ‘asm’ or ‘__attribute__’ before ‘{’ token
/var/tmp/portage/x11-drivers/ati-drivers-8.33.6-r90/work/common/lib/modules/fglrx/build_mod/firegl_public.c:2451: error: expected ‘=’, ‘,’, ‘;’, ‘asm’ or ‘__attribute__’ before ‘{’ token
/var/tmp/portage/x11-drivers/ati-drivers-8.33.6-r90/work/common/lib/modules/fglrx/build_mod/firegl_public.c:2456: error: expected ‘=’, ‘,’, ‘;’, ‘asm’ or ‘__attribute__’ before ‘{’ token
/var/tmp/portage/x11-drivers/ati-drivers-8.33.6-r90/work/common/lib/modules/fglrx/build_mod/firegl_public.c:2461: error: expected ‘=’, ‘,’, ‘;’, ‘asm’ or ‘__attribute__’ before ‘{’ token
/var/tmp/portage/x11-drivers/ati-drivers-8.33.6-r90/work/common/lib/modules/fglrx/build_mod/firegl_public.c:2466: error: expected ‘=’, ‘,’, ‘;’, ‘asm’ or ‘__attribute__’ before ‘{’ token
/var/tmp/portage/x11-drivers/ati-drivers-8.33.6-r90/work/common/lib/modules/fglrx/build_mod/firegl_public.c:2471: error: expected ‘=’, ‘,’, ‘;’, ‘asm’ or ‘__attribute__’ before ‘{’ token
/var/tmp/portage/x11-drivers/ati-drivers-8.33.6-r90/work/common/lib/modules/fglrx/build_mod/firegl_public.c:2477: error: expected ‘=’, ‘,’, ‘;’, ‘asm’ or ‘__attribute__’ before ‘{’ token
/var/tmp/portage/x11-drivers/ati-drivers-8.33.6-r90/work/common/lib/modules/fglrx/build_mod/firegl_public.c:2482: error: expected ‘=’, ‘,’, ‘;’, ‘asm’ or ‘__attribute__’ before ‘{’ token
/var/tmp/portage/x11-drivers/ati-drivers-8.33.6-r90/work/common/lib/modules/fglrx/build_mod/firegl_public.c:2487: error: expected ‘=’, ‘,’, ‘;’, ‘asm’ or ‘__attribute__’ before ‘{’ token
/var/tmp/portage/x11-drivers/ati-drivers-8.33.6-r90/work/common/lib/modules/fglrx/build_mod/firegl_public.c:2492: error: expected ‘=’, ‘,’, ‘;’, ‘asm’ or ‘__attribute__’ before ‘{’ token
/var/tmp/portage/x11-drivers/ati-drivers-8.33.6-r90/work/common/lib/modules/fglrx/build_mod/firegl_public.c:2500: error: expected ‘=’, ‘,’, ‘;’, ‘asm’ or ‘__attribute__’ before ‘{’ token
/var/tmp/portage/x11-drivers/ati-drivers-8.33.6-r90/work/common/lib/modules/fglrx/build_mod/firegl_public.c:2505: error: expected ‘=’, ‘,’, ‘;’, ‘asm’ or ‘__attribute__’ before ‘{’ token
/var/tmp/portage/x11-drivers/ati-drivers-8.33.6-r90/work/common/lib/modules/fglrx/build_mod/firegl_public.c:2510: error: expected ‘=’, ‘,’, ‘;’, ‘asm’ or ‘__attribute__’ before ‘{’ token
/var/tmp/portage/x11-drivers/ati-drivers-8.33.6-r90/work/common/lib/modules/fglrx/build_mod/firegl_public.c:2515: error: expected ‘=’, ‘,’, ‘;’, ‘asm’ or ‘__attribute__’ before ‘{’ token
/var/tmp/portage/x11-drivers/ati-drivers-8.33.6-r90/work/common/lib/modules/fglrx/build_mod/firegl_public.c:2520: error: expected ‘=’, ‘,’, ‘;’, ‘asm’ or ‘__attribute__’ before ‘{’ token
/var/tmp/portage/x11-drivers/ati-drivers-8.33.6-r90/work/common/lib/modules/fglrx/build_mod/firegl_public.c:2525: error: expected ‘=’, ‘,’, ‘;’, ‘asm’ or ‘__attribute__’ before ‘{’ token
/var/tmp/portage/x11-drivers/ati-drivers-8.33.6-r90/work/common/lib/modules/fglrx/build_mod/firegl_public.c:2530: error: expected ‘=’, ‘,’, ‘;’, ‘asm’ or ‘__attribute__’ before ‘{’ token
/var/tmp/portage/x11-drivers/ati-drivers-8.33.6-r90/work/common/lib/modules/fglrx/build_mod/firegl_public.c:2538: error: expected ‘=’, ‘,’, ‘;’, ‘asm’ or ‘__attribute__’ before ‘{’ token
/var/tmp/portage/x11-drivers/ati-drivers-8.33.6-r90/work/common/lib/modules/fglrx/build_mod/firegl_public.c:2543: error: expected ‘=’, ‘,’, ‘;’, ‘asm’ or ‘__attribute__’ before ‘{’ token
/var/tmp/portage/x11-drivers/ati-drivers-8.33.6-r90/work/common/lib/modules/fglrx/build_mod/firegl_public.c:2562: error: storage class specified for parameter ‘irq_handler_func’
/var/tmp/portage/x11-drivers/ati-drivers-8.33.6-r90/work/common/lib/modules/fglrx/build_mod/firegl_public.c:2565: error: expected ‘=’, ‘,’, ‘;’, ‘asm’ or ‘__attribute__’ before ‘{’ token
/var/tmp/portage/x11-drivers/ati-drivers-8.33.6-r90/work/common/lib/modules/fglrx/build_mod/firegl_public.c:2573: error: expected ‘=’, ‘,’, ‘;’, ‘asm’ or ‘__attribute__’ before ‘{’ token
/var/tmp/portage/x11-drivers/ati-drivers-8.33.6-r90/work/common/lib/modules/fglrx/build_mod/firegl_public.c:2581: error: expected ‘=’, ‘,’, ‘;’, ‘asm’ or ‘__attribute__’ before ‘{’ token
/var/tmp/portage/x11-drivers/ati-drivers-8.33.6-r90/work/common/lib/modules/fglrx/build_mod/firegl_public.c:2609: error: expected ‘=’, ‘,’, ‘;’, ‘asm’ or ‘__attribute__’ before ‘{’ token
/var/tmp/portage/x11-drivers/ati-drivers-8.33.6-r90/work/common/lib/modules/fglrx/build_mod/firegl_public.c:2615: error: expected ‘=’, ‘,’, ‘;’, ‘asm’ or ‘__attribute__’ before ‘{’ token
/var/tmp/portage/x11-drivers/ati-drivers-8.33.6-r90/work/common/lib/modules/fglrx/build_mod/firegl_public.c:2632: error: storage class specified for parameter ‘mem_map_t’
/var/tmp/portage/x11-drivers/ati-drivers-8.33.6-r90/work/common/lib/modules/fglrx/build_mod/firegl_public.c:2633: error: expected ‘=’, ‘,’, ‘;’, ‘asm’ or ‘__attribute__’ before ‘*’ token
/var/tmp/portage/x11-drivers/ati-drivers-8.33.6-r90/work/common/lib/modules/fglrx/build_mod/firegl_public.c:2638: error: expected ‘=’, ‘,’, ‘;’, ‘asm’ or ‘__attribute__’ before ‘do_vm_nopage’
/var/tmp/portage/x11-drivers/ati-drivers-8.33.6-r90/work/common/lib/modules/fglrx/build_mod/firegl_public.c:2674: error: expected ‘=’, ‘,’, ‘;’, ‘asm’ or ‘__attribute__’ before ‘do_vm_shm_nopage’
/var/tmp/portage/x11-drivers/ati-drivers-8.33.6-r90/work/common/lib/modules/fglrx/build_mod/firegl_public.c:2760: error: expected ‘=’, ‘,’, ‘;’, ‘asm’ or ‘__attribute__’ before ‘do_vm_dma_nopage’
/var/tmp/portage/x11-drivers/ati-drivers-8.33.6-r90/work/common/lib/modules/fglrx/build_mod/firegl_public.c:2800: error: expected ‘=’, ‘,’, ‘;’, ‘asm’ or ‘__attribute__’ before ‘do_vm_kmap_nopage’
/var/tmp/portage/x11-drivers/ati-drivers-8.33.6-r90/work/common/lib/modules/fglrx/build_mod/firegl_public.c:2838: error: expected ‘=’, ‘,’, ‘;’, ‘asm’ or ‘__attribute__’ before ‘do_vm_pcie_nopage’
/var/tmp/portage/x11-drivers/ati-drivers-8.33.6-r90/work/common/lib/modules/fglrx/build_mod/firegl_public.c:2890: error: expected ‘=’, ‘,’, ‘;’, ‘asm’ or ‘__attribute__’ before ‘do_vm_gart_nopage’
/var/tmp/portage/x11-drivers/ati-drivers-8.33.6-r90/work/common/lib/modules/fglrx/build_mod/firegl_public.c:2913: error: expected ‘=’, ‘,’, ‘;’, ‘asm’ or ‘__attribute__’ before ‘vm_nopage’
/var/tmp/portage/x11-drivers/ati-drivers-8.33.6-r90/work/common/lib/modules/fglrx/build_mod/firegl_public.c:2950: error: expected ‘=’, ‘,’, ‘;’, ‘asm’ or ‘__attribute__’ before ‘vm_shm_nopage’
/var/tmp/portage/x11-drivers/ati-drivers-8.33.6-r90/work/common/lib/modules/fglrx/build_mod/firegl_public.c:2964: error: expected ‘=’, ‘,’, ‘;’, ‘asm’ or ‘__attribute__’ before ‘vm_dma_nopage’
/var/tmp/portage/x11-drivers/ati-drivers-8.33.6-r90/work/common/lib/modules/fglrx/build_mod/firegl_public.c:2972: error: expected ‘=’, ‘,’, ‘;’, ‘asm’ or ‘__attribute__’ before ‘vm_kmap_nopage’
/var/tmp/portage/x11-drivers/ati-drivers-8.33.6-r90/work/common/lib/modules/fglrx/build_mod/firegl_public.c:2980: error: expected ‘=’, ‘,’, ‘;’, ‘asm’ or ‘__attribute__’ before ‘vm_pcie_nopage’
/var/tmp/portage/x11-drivers/ati-drivers-8.33.6-r90/work/common/lib/modules/fglrx/build_mod/firegl_public.c:2987: error: expected ‘=’, ‘,’, ‘;’, ‘asm’ or ‘__attribute__’ before ‘vm_gart_nopage’
/var/tmp/portage/x11-drivers/ati-drivers-8.33.6-r90/work/common/lib/modules/fglrx/build_mod/firegl_public.c:3075: error: expected ‘=’, ‘,’, ‘;’, ‘asm’ or ‘__attribute__’ before ‘{’ token
/var/tmp/portage/x11-drivers/ati-drivers-8.33.6-r90/work/common/lib/modules/fglrx/build_mod/firegl_public.c:3080: error: expected ‘=’, ‘,’, ‘;’, ‘asm’ or ‘__attribute__’ before ‘{’ token
/var/tmp/portage/x11-drivers/ati-drivers-8.33.6-r90/work/common/lib/modules/fglrx/build_mod/firegl_public.c:3085: error: expected ‘=’, ‘,’, ‘;’, ‘asm’ or ‘__attribute__’ before ‘{’ token
/var/tmp/portage/x11-drivers/ati-drivers-8.33.6-r90/work/common/lib/modules/fglrx/build_mod/firegl_public.c:3090: error: expected ‘=’, ‘,’, ‘;’, ‘asm’ or ‘__attribute__’ before ‘{’ token
/var/tmp/portage/x11-drivers/ati-drivers-8.33.6-r90/work/common/lib/modules/fglrx/build_mod/firegl_public.c:3099: error: expected ‘=’, ‘,’, ‘;’, ‘asm’ or ‘__attribute__’ before ‘{’ token
/var/tmp/portage/x11-drivers/ati-drivers-8.33.6-r90/work/common/lib/modules/fglrx/build_mod/firegl_public.c:3111: error: expected ‘=’, ‘,’, ‘;’, ‘asm’ or ‘__attribute__’ before ‘{’ token
/var/tmp/portage/x11-drivers/ati-drivers-8.33.6-r90/work/common/lib/modules/fglrx/build_mod/firegl_public.c:3135: error: expected ‘=’, ‘,’, ‘;’, ‘asm’ or ‘__attribute__’ before ‘{’ token
/var/tmp/portage/x11-drivers/ati-drivers-8.33.6-r90/work/common/lib/modules/fglrx/build_mod/firegl_public.c:3162: error: expected ‘=’, ‘,’, ‘;’, ‘asm’ or ‘__attribute__’ before ‘{’ token
/var/tmp/portage/x11-drivers/ati-drivers-8.33.6-r90/work/common/lib/modules/fglrx/build_mod/firegl_public.c:3178: error: expected ‘=’, ‘,’, ‘;’, ‘asm’ or ‘__attribute__’ before ‘{’ token
/var/tmp/portage/x11-drivers/ati-drivers-8.33.6-r90/work/common/lib/modules/fglrx/build_mod/firegl_public.c:3180: error: expected ‘=’, ‘,’, ‘;’, ‘asm’ or ‘__attribute__’ before ‘{’ token
/var/tmp/portage/x11-drivers/ati-drivers-8.33.6-r90/work/common/lib/modules/fglrx/build_mod/firegl_public.c:3182: error: storage class specified for parameter ‘vm_ops’
/var/tmp/portage/x11-drivers/ati-drivers-8.33.6-r90/work/common/lib/modules/fglrx/build_mod/firegl_public.c:3182: error: parameter ‘vm_ops’ is initialized
/var/tmp/portage/x11-drivers/ati-drivers-8.33.6-r90/work/common/lib/modules/fglrx/build_mod/firegl_public.c:3184: error: ‘vm_nopage’ undeclared (first use in this function)
/var/tmp/portage/x11-drivers/ati-drivers-8.33.6-r90/work/common/lib/modules/fglrx/build_mod/firegl_public.c:3185: error: ‘ip_drm_vm_open’ undeclared (first use in this function)
/var/tmp/portage/x11-drivers/ati-drivers-8.33.6-r90/work/common/lib/modules/fglrx/build_mod/firegl_public.c:3186: error: ‘ip_drm_vm_close’ undeclared (first use in this function)
/var/tmp/portage/x11-drivers/ati-drivers-8.33.6-r90/work/common/lib/modules/fglrx/build_mod/firegl_public.c:3200: error: storage class specified for parameter ‘vm_shm_ops’
/var/tmp/portage/x11-drivers/ati-drivers-8.33.6-r90/work/common/lib/modules/fglrx/build_mod/firegl_public.c:3200: error: parameter ‘vm_shm_ops’ is initialized
/var/tmp/portage/x11-drivers/ati-drivers-8.33.6-r90/work/common/lib/modules/fglrx/build_mod/firegl_public.c:3202: error: ‘vm_shm_nopage’ undeclared (first use in this function)
/var/tmp/portage/x11-drivers/ati-drivers-8.33.6-r90/work/common/lib/modules/fglrx/build_mod/firegl_public.c:3207: error: storage class specified for parameter ‘vm_pci_bq_ops’
/var/tmp/portage/x11-drivers/ati-drivers-8.33.6-r90/work/common/lib/modules/fglrx/build_mod/firegl_public.c:3207: error: parameter ‘vm_pci_bq_ops’ is initialized
/var/tmp/portage/x11-drivers/ati-drivers-8.33.6-r90/work/common/lib/modules/fglrx/build_mod/firegl_public.c:3209: error: ‘vm_dma_nopage’ undeclared (first use in this function)
/var/tmp/portage/x11-drivers/ati-drivers-8.33.6-r90/work/common/lib/modules/fglrx/build_mod/firegl_public.c:3214: error: storage class specified for parameter ‘vm_ctx_ops’
/var/tmp/portage/x11-drivers/ati-drivers-8.33.6-r90/work/common/lib/modules/fglrx/build_mod/firegl_public.c:3214: error: parameter ‘vm_ctx_ops’ is initialized
/var/tmp/portage/x11-drivers/ati-drivers-8.33.6-r90/work/common/lib/modules/fglrx/build_mod/firegl_public.c:3221: error: storage class specified for parameter ‘vm_pcie_ops’
/var/tmp/portage/x11-drivers/ati-drivers-8.33.6-r90/work/common/lib/modules/fglrx/build_mod/firegl_public.c:3221: error: parameter ‘vm_pcie_ops’ is initialized
/var/tmp/portage/x11-drivers/ati-drivers-8.33.6-r90/work/common/lib/modules/fglrx/build_mod/firegl_public.c:3223: error: ‘vm_pcie_nopage’ undeclared (first use in this function)
/var/tmp/portage/x11-drivers/ati-drivers-8.33.6-r90/work/common/lib/modules/fglrx/build_mod/firegl_public.c:3228: error: storage class specified for parameter ‘vm_kmap_ops’
/var/tmp/portage/x11-drivers/ati-drivers-8.33.6-r90/work/common/lib/modules/fglrx/build_mod/firegl_public.c:3228: error: parameter ‘vm_kmap_ops’ is initialized
/var/tmp/portage/x11-drivers/ati-drivers-8.33.6-r90/work/common/lib/modules/fglrx/build_mod/firegl_public.c:3230: error: ‘vm_kmap_nopage’ undeclared (first use in this function)
/var/tmp/portage/x11-drivers/ati-drivers-8.33.6-r90/work/common/lib/modules/fglrx/build_mod/firegl_public.c:3235: error: storage class specified for parameter ‘vm_gart_ops’
/var/tmp/portage/x11-drivers/ati-drivers-8.33.6-r90/work/common/lib/modules/fglrx/build_mod/firegl_public.c:3235: error: parameter ‘vm_gart_ops’ is initialized
/var/tmp/portage/x11-drivers/ati-drivers-8.33.6-r90/work/common/lib/modules/fglrx/build_mod/firegl_public.c:3237: error: ‘vm_gart_nopage’ undeclared (first use in this function)
/var/tmp/portage/x11-drivers/ati-drivers-8.33.6-r90/work/common/lib/modules/fglrx/build_mod/firegl_public.c:3244: error: storage class specified for parameter ‘vm_agp_bq_ops’
/var/tmp/portage/x11-drivers/ati-drivers-8.33.6-r90/work/common/lib/modules/fglrx/build_mod/firegl_public.c:3244: error: parameter ‘vm_agp_bq_ops’ is initialized
/var/tmp/portage/x11-drivers/ati-drivers-8.33.6-r90/work/common/lib/modules/fglrx/build_mod/firegl_public.c:3264: error: expected ‘=’, ‘,’, ‘;’, ‘asm’ or ‘__attribute__’ before ‘{’ token
/var/tmp/portage/x11-drivers/ati-drivers-8.33.6-r90/work/common/lib/modules/fglrx/build_mod/firegl_public.c:3450: error: parameter ‘__ke_agp_try_unsupported’ is initialized
/var/tmp/portage/x11-drivers/ati-drivers-8.33.6-r90/work/common/lib/modules/fglrx/build_mod/firegl_public.c:3453: error: storage class specified for parameter ‘__fgl_agp_init’
/var/tmp/portage/x11-drivers/ati-drivers-8.33.6-r90/work/common/lib/modules/fglrx/build_mod/firegl_public.c:3454: error: storage class specified for parameter ‘__fgl_agp_cleanup’
/var/tmp/portage/x11-drivers/ati-drivers-8.33.6-r90/work/common/lib/modules/fglrx/build_mod/firegl_public.c:3455: error: storage class specified for parameter ‘__fgl_agp_try_unsupported’
/var/tmp/portage/x11-drivers/ati-drivers-8.33.6-r90/work/common/lib/modules/fglrx/build_mod/firegl_public.c:3456: error: storage class specified for parameter ‘__fgl_agp_allocate_memory_phys_list’
/var/tmp/portage/x11-drivers/ati-drivers-8.33.6-r90/work/common/lib/modules/fglrx/build_mod/firegl_public.c:3472: error: parameter ‘__ke_firegl_agpgart_inuse’ is initialized
/var/tmp/portage/x11-drivers/ati-drivers-8.33.6-r90/work/common/lib/modules/fglrx/build_mod/firegl_public.c:3488: error: storage class specified for parameter ‘drm_agp_t’
/var/tmp/portage/x11-drivers/ati-drivers-8.33.6-r90/work/common/lib/modules/fglrx/build_mod/firegl_public.c:3499: error: storage class specified for parameter ‘firegl_agp_bridge’
/var/tmp/portage/x11-drivers/ati-drivers-8.33.6-r90/work/common/lib/modules/fglrx/build_mod/firegl_public.c:3499: error: parameter ‘firegl_agp_bridge’ is initialized
/var/tmp/portage/x11-drivers/ati-drivers-8.33.6-r90/work/common/lib/modules/fglrx/build_mod/firegl_public.c:3500: error: storage class specified for parameter ‘firegl_pci_device’
/var/tmp/portage/x11-drivers/ati-drivers-8.33.6-r90/work/common/lib/modules/fglrx/build_mod/firegl_public.c:3500: error: parameter ‘firegl_pci_device’ is initialized
/var/tmp/portage/x11-drivers/ati-drivers-8.33.6-r90/work/common/lib/modules/fglrx/build_mod/firegl_public.c:3504: error: expected ‘=’, ‘,’, ‘;’, ‘asm’ or ‘__attribute__’ before ‘{’ token
/var/tmp/portage/x11-drivers/ati-drivers-8.33.6-r90/work/common/lib/modules/fglrx/build_mod/firegl_public.c:3509: error: expected ‘=’, ‘,’, ‘;’, ‘asm’ or ‘__attribute__’ before ‘{’ token
/var/tmp/portage/x11-drivers/ati-drivers-8.33.6-r90/work/common/lib/modules/fglrx/build_mod/firegl_public.c:3514: error: expected ‘=’, ‘,’, ‘;’, ‘asm’ or ‘__attribute__’ before ‘{’ token
/var/tmp/portage/x11-drivers/ati-drivers-8.33.6-r90/work/common/lib/modules/fglrx/build_mod/firegl_public.c:3520: error: expected ‘=’, ‘,’, ‘;’, ‘asm’ or ‘__attribute__’ before ‘{’ token
/var/tmp/portage/x11-drivers/ati-drivers-8.33.6-r90/work/common/lib/modules/fglrx/build_mod/firegl_public.c:3526: error: expected ‘=’, ‘,’, ‘;’, ‘asm’ or ‘__attribute__’ before ‘{’ token
/var/tmp/portage/x11-drivers/ati-drivers-8.33.6-r90/work/common/lib/modules/fglrx/build_mod/firegl_public.c:3531: error: expected ‘=’, ‘,’, ‘;’, ‘asm’ or ‘__attribute__’ before ‘drm_agp’
/var/tmp/portage/x11-drivers/ati-drivers-8.33.6-r90/work/common/lib/modules/fglrx/build_mod/firegl_public.c:3540: error: expected declaration specifiers before ‘;’ token
/var/tmp/portage/x11-drivers/ati-drivers-8.33.6-r90/work/common/lib/modules/fglrx/build_mod/firegl_public.c:3581: error: expected ‘=’, ‘,’, ‘;’, ‘asm’ or ‘__attribute__’ before ‘*’ token
/var/tmp/portage/x11-drivers/ati-drivers-8.33.6-r90/work/common/lib/modules/fglrx/build_mod/firegl_public.c:3690: error: expected ‘=’, ‘,’, ‘;’, ‘asm’ or ‘__attribute__’ before ‘{’ token
/var/tmp/portage/x11-drivers/ati-drivers-8.33.6-r90/work/common/lib/modules/fglrx/build_mod/firegl_public.c:3716: error: expected ‘=’, ‘,’, ‘;’, ‘asm’ or ‘__attribute__’ before ‘{’ token
/var/tmp/portage/x11-drivers/ati-drivers-8.33.6-r90/work/common/lib/modules/fglrx/build_mod/firegl_public.c:3724: error: expected ‘=’, ‘,’, ‘;’, ‘asm’ or ‘__attribute__’ before ‘{’ token
/var/tmp/portage/x11-drivers/ati-drivers-8.33.6-r90/work/common/lib/modules/fglrx/build_mod/firegl_public.c:3749: error: expected ‘=’, ‘,’, ‘;’, ‘asm’ or ‘__attribute__’ before ‘{’ token
/var/tmp/portage/x11-drivers/ati-drivers-8.33.6-r90/work/common/lib/modules/fglrx/build_mod/firegl_public.c:3763: error: expected ‘=’, ‘,’, ‘;’, ‘asm’ or ‘__attribute__’ before ‘{’ token
/var/tmp/portage/x11-drivers/ati-drivers-8.33.6-r90/work/common/lib/modules/fglrx/build_mod/firegl_public.c:3769: error: expected ‘=’, ‘,’, ‘;’, ‘asm’ or ‘__attribute__’ before ‘{’ token
/var/tmp/portage/x11-drivers/ati-drivers-8.33.6-r90/work/common/lib/modules/fglrx/build_mod/firegl_public.c:3777: error: expected ‘=’, ‘,’, ‘;’, ‘asm’ or ‘__attribute__’ before ‘{’ token
/var/tmp/portage/x11-drivers/ati-drivers-8.33.6-r90/work/common/lib/modules/fglrx/build_mod/firegl_public.c:3785: error: expected ‘=’, ‘,’, ‘;’, ‘asm’ or ‘__attribute__’ before ‘{’ token
/var/tmp/portage/x11-drivers/ati-drivers-8.33.6-r90/work/common/lib/modules/fglrx/build_mod/firegl_public.c:3793: error: expected ‘=’, ‘,’, ‘;’, ‘asm’ or ‘__attribute__’ before ‘{’ token
/var/tmp/portage/x11-drivers/ati-drivers-8.33.6-r90/work/common/lib/modules/fglrx/build_mod/firegl_public.c:3802: error: expected ‘=’, ‘,’, ‘;’, ‘asm’ or ‘__attribute__’ before ‘{’ token
/var/tmp/portage/x11-drivers/ati-drivers-8.33.6-r90/work/common/lib/modules/fglrx/build_mod/firegl_public.c:3833: error: expected ‘=’, ‘,’, ‘;’, ‘asm’ or ‘__attribute__’ before ‘{’ token
/var/tmp/portage/x11-drivers/ati-drivers-8.33.6-r90/work/common/lib/modules/fglrx/build_mod/firegl_public.c:3844: error: expected ‘=’, ‘,’, ‘;’, ‘asm’ or ‘__attribute__’ before ‘{’ token
/var/tmp/portage/x11-drivers/ati-drivers-8.33.6-r90/work/common/lib/modules/fglrx/build_mod/firegl_public.c:3850: error: expected ‘=’, ‘,’, ‘;’, ‘asm’ or ‘__attribute__’ before ‘{’ token
/var/tmp/portage/x11-drivers/ati-drivers-8.33.6-r90/work/common/lib/modules/fglrx/build_mod/firegl_public.c:3916: error: expected ‘=’, ‘,’, ‘;’, ‘asm’ or ‘__attribute__’ before ‘{’ token
/var/tmp/portage/x11-drivers/ati-drivers-8.33.6-r90/work/common/lib/modules/fglrx/build_mod/firegl_public.c:3922: error: expected ‘=’, ‘,’, ‘;’, ‘asm’ or ‘__attribute__’ before ‘{’ token
/var/tmp/portage/x11-drivers/ati-drivers-8.33.6-r90/work/common/lib/modules/fglrx/build_mod/firegl_public.c:3993: error: expected ‘=’, ‘,’, ‘;’, ‘asm’ or ‘__attribute__’ before ‘{’ token
/var/tmp/portage/x11-drivers/ati-drivers-8.33.6-r90/work/common/lib/modules/fglrx/build_mod/firegl_public.c:4009: error: expected ‘=’, ‘,’, ‘;’, ‘asm’ or ‘__attribute__’ before ‘{’ token
/var/tmp/portage/x11-drivers/ati-drivers-8.33.6-r90/work/common/lib/modules/fglrx/build_mod/firegl_public.c:4015: error: expected ‘=’, ‘,’, ‘;’, ‘asm’ or ‘__attribute__’ before ‘{’ token
/var/tmp/portage/x11-drivers/ati-drivers-8.33.6-r90/work/common/lib/modules/fglrx/build_mod/firegl_public.c:4026: error: expected ‘=’, ‘,’, ‘;’, ‘asm’ or ‘__attribute__’ before ‘{’ token
/var/tmp/portage/x11-drivers/ati-drivers-8.33.6-r90/work/common/lib/modules/fglrx/build_mod/firegl_public.c:4047: error: expected ‘=’, ‘,’, ‘;’, ‘asm’ or ‘__attribute__’ before ‘{’ token
/var/tmp/portage/x11-drivers/ati-drivers-8.33.6-r90/work/common/lib/modules/fglrx/build_mod/firegl_public.c:4134: error: expected ‘=’, ‘,’, ‘;’, ‘asm’ or ‘__attribute__’ before ‘{’ token
/var/tmp/portage/x11-drivers/ati-drivers-8.33.6-r90/work/common/lib/modules/fglrx/build_mod/firegl_public.c:4176: error: expected ‘=’, ‘,’, ‘;’, ‘asm’ or ‘__attribute__’ before ‘{’ token
/var/tmp/portage/x11-drivers/ati-drivers-8.33.6-r90/work/common/lib/modules/fglrx/build_mod/firegl_public.c:4211: error: storage class specified for parameter ‘kasContext_t’
/var/tmp/portage/x11-drivers/ati-drivers-8.33.6-r90/work/common/lib/modules/fglrx/build_mod/firegl_public.c:4214: error: expected ‘=’, ‘,’, ‘;’, ‘asm’ or ‘__attribute__’ before ‘kasContext’
/var/tmp/portage/x11-drivers/ati-drivers-8.33.6-r90/work/common/lib/modules/fglrx/build_mod/firegl_public.c:4219: error: expected declaration specifiers before ‘__attribute__’
/var/tmp/portage/x11-drivers/ati-drivers-8.33.6-r90/work/common/lib/modules/fglrx/build_mod/firegl_public.c:4244: error: expected ‘=’, ‘,’, ‘;’, ‘asm’ or ‘__attribute__’ before ‘{’ token
/var/tmp/portage/x11-drivers/ati-drivers-8.33.6-r90/work/common/lib/modules/fglrx/build_mod/firegl_public.c:4277: error: expected ‘=’, ‘,’, ‘;’, ‘asm’ or ‘__attribute__’ before ‘{’ token
/var/tmp/portage/x11-drivers/ati-drivers-8.33.6-r90/work/common/lib/modules/fglrx/build_mod/firegl_public.c:4298: error: expected ‘=’, ‘,’, ‘;’, ‘asm’ or ‘__attribute__’ before ‘{’ token
/var/tmp/portage/x11-drivers/ati-drivers-8.33.6-r90/work/common/lib/modules/fglrx/build_mod/firegl_public.c:4321: error: expected ‘=’, ‘,’, ‘;’, ‘asm’ or ‘__attribute__’ before ‘{’ token
/var/tmp/portage/x11-drivers/ati-drivers-8.33.6-r90/work/common/lib/modules/fglrx/build_mod/firegl_public.c:4342: error: storage class specified for parameter ‘kasIdhRoutine_t’
/var/tmp/portage/x11-drivers/ati-drivers-8.33.6-r90/work/common/lib/modules/fglrx/build_mod/firegl_public.c:4348: error: expected specifier-qualifier-list before ‘kasIdhRoutine_t’
/var/tmp/portage/x11-drivers/ati-drivers-8.33.6-r90/work/common/lib/modules/fglrx/build_mod/firegl_public.c:4350: error: storage class specified for parameter ‘kasIdh_t’
/var/tmp/portage/x11-drivers/ati-drivers-8.33.6-r90/work/common/lib/modules/fglrx/build_mod/firegl_public.c:4366: error: expected ‘=’, ‘,’, ‘;’, ‘asm’ or ‘__attribute__’ before ‘{’ token
/var/tmp/portage/x11-drivers/ati-drivers-8.33.6-r90/work/common/lib/modules/fglrx/build_mod/firegl_public.c:4385: error: expected ‘=’, ‘,’, ‘;’, ‘asm’ or ‘__attribute__’ before ‘{’ token
/var/tmp/portage/x11-drivers/ati-drivers-8.33.6-r90/work/common/lib/modules/fglrx/build_mod/firegl_public.c:4399: error: expected ‘=’, ‘,’, ‘;’, ‘asm’ or ‘__attribute__’ before ‘{’ token
/var/tmp/portage/x11-drivers/ati-drivers-8.33.6-r90/work/common/lib/modules/fglrx/build_mod/firegl_public.c:4415: error: expected ‘=’, ‘,’, ‘;’, ‘asm’ or ‘__attribute__’ before ‘{’ token
/var/tmp/portage/x11-drivers/ati-drivers-8.33.6-r90/work/common/lib/modules/fglrx/build_mod/firegl_public.c:4422: error: storage class specified for parameter ‘kasSyncRoutine_t’
/var/tmp/portage/x11-drivers/ati-drivers-8.33.6-r90/work/common/lib/modules/fglrx/build_mod/firegl_public.c:4441: error: expected ‘=’, ‘,’, ‘;’, ‘asm’ or ‘__attribute__’ before ‘{’ token
/var/tmp/portage/x11-drivers/ati-drivers-8.33.6-r90/work/common/lib/modules/fglrx/build_mod/firegl_public.c:4483: error: expected ‘=’, ‘,’, ‘;’, ‘asm’ or ‘__attribute__’ before ‘{’ token
/var/tmp/portage/x11-drivers/ati-drivers-8.33.6-r90/work/common/lib/modules/fglrx/build_mod/firegl_public.c:4492: error: old-style parameter declarations in prototyped function definition
/var/tmp/portage/x11-drivers/ati-drivers-8.33.6-r90/work/common/lib/modules/fglrx/build_mod/firegl_public.c:198: error: parameter name omitted
/var/tmp/portage/x11-drivers/ati-drivers-8.33.6-r90/work/common/lib/modules/fglrx/build_mod/firegl_public.c:198: error: parameter name omitted
/var/tmp/portage/x11-drivers/ati-drivers-8.33.6-r90/work/common/lib/modules/fglrx/build_mod/firegl_public.c:198: error: parameter name omitted
/var/tmp/portage/x11-drivers/ati-drivers-8.33.6-r90/work/common/lib/modules/fglrx/build_mod/firegl_public.c:4492: error: expected ‘{’ at end of input
make[2]: *** [/var/tmp/portage/x11-drivers/ati-drivers-8.33.6-r90/work/common/lib/modules/fglrx/build_mod/firegl_public.o] Error 1
make[1]: *** [_module_/var/tmp/portage/x11-drivers/ati-drivers-8.33.6-r90/work/common/lib/modules/fglrx/build_mod] Error 2
make: *** [kmod_build] Error 2

!!! ERROR: x11-drivers/ati-drivers-8.33.6-r90 failed.
Call stack:
  ebuild.sh, line 1611:   Called dyn_compile
  ebuild.sh, line 968:   Called qa_call 'src_compile'
  environment, line 4086:   Called src_compile
  ati-drivers-8.33.6-r90.ebuild, line 154:   Called linux-mod_src_compile
  linux-mod.eclass, line 510:   Called die

!!! Unable to make  GCC_VER_MAJ=4 KVER=2.6.20-rc6-gentoo KDIR=/usr/src/linux kmod_build.
!!! If you need support, post the topmost build error, and the call stack if relevant.
!!! A complete build log is located at '/var/tmp/portage/x11-drivers/ati-drivers-8.33.6-r90/temp/build.log'.