dcc-send.c: In function `dcc_send_add':
dcc-send.c:97: erreur: « glob_t » non déclaré (première utilisation dans cette f
onction)
dcc-send.c:97: erreur: (Chaque identificateur non déclaré est rapporté une seule
fois
dcc-send.c:97: erreur: pour chaque fonction dans laquelle il apparaît.)
dcc-send.c:97: erreur: erreur d'analyse syntaxique avant « globbuf »
dcc-send.c:101: erreur: « globbuf » non déclaré (première utilisation dans cette
fonction)
dcc-send.c:102: erreur: « GLOB_NOCHECK » non déclaré (première utilisation dans
cette fonction)
dcc-send.c:110: attention : déclaration implicite de la fonction « glob »
dcc-send.c:115: erreur: « GLOB_APPEND » non déclaré (première utilisation dans c
ette fonction)
dcc-send.c:165: attention : déclaration implicite de la fonction « globfree »
make[4]: *** [dcc-send.o] Erreur 1
make[4]: Leaving directory `/home/jp/irssi-0.8.10/src/irc/dcc'
make[3]: *** [all-recursive] Erreur 1
make[3]: Leaving directory `/home/jp/irssi-0.8.10/src/irc'
make[2]: *** [all-recursive] Erreur 1
make[2]: Leaving directory `/home/jp/irssi-0.8.10/src'
make[1]: *** [all-recursive] Erreur 1
make[1]: Leaving directory `/home/jp/irssi-0.8.10'
make: *** [all-recursive-am] Erreur 2