All pastes #330525 Raw Edit

hillct

public text v1 · immutable
#330525 ·published 2007-01-28 00:03 UTC
rendered paste body
./configure  --with-zlib --with-mysql --enable-mbstring --with-apxs=/usr/local/apache/bin/apxs --enable-fastcgi and --enable-discard-path 

[root@server php-5.2.0]# make

[...]

[root@server php-5.2.0]# make test

[...]

=====================================================================
FAILED TEST SUMMARY
---------------------------------------------------------------------
Test for buffering in core functions with implicit flush off [tests/func/008.phpt]
Bug #37514 (strtotime doesn't assume year correctly). [ext/date/tests/bug37514.phpt]
date OO cloning [ext/date/tests/oo_002.phpt]
Bug #16069 [ext/iconv/tests/bug16069.phpt]
iconv stream filter [ext/iconv/tests/iconv_stream_filter.phpt]
HTML input/output [ext/mbstring/tests/htmlent.phpt]
mb_output_handler() (Shift_JIS) [ext/mbstring/tests/mb_output_handler_shift_jis.phpt]
htmlentities() test 4 (setlocale / ja_JP.EUC-JP) [ext/standard/tests/strings/htmlentities04.phpt]
htmlentities() test 15 (setlocale / KOI8-R) [ext/standard/tests/strings/htmlentities15.phpt]
=====================================================================

[root@server php-5.2.0]# make install
Installing PHP SAPI module:       apache
[activating module `php5' in /usr/local/apache/conf/httpd.conf]
cp libs/libphp5.so /usr/local/apache/libexec/libphp5.so
cp: cannot stat `libs/libphp5.so': No such file or directory
apxs:Break: Command failed with rc=1
make: *** [install-sapi] Error 1
[root@server php-5.2.0]#  

------------------------------------------------------------------------------------------------------
After make distclean, and repeat of above, the tests reported the following failures:

=====================================================================
FAILED TEST SUMMARY
---------------------------------------------------------------------
Test for buffering in core functions with implicit flush off [tests/func/008.phpt]
Bug #37514 (strtotime doesn't assume year correctly). [ext/date/tests/bug37514.phpt]
date OO cloning [ext/date/tests/oo_002.phpt]
Bug #16069 [ext/iconv/tests/bug16069.phpt]
iconv stream filter [ext/iconv/tests/iconv_stream_filter.phpt]
HTML input/output [ext/mbstring/tests/htmlent.phpt]
mb_output_handler() (Shift_JIS) [ext/mbstring/tests/mb_output_handler_shift_jis.phpt]
htmlentities() test 4 (setlocale / ja_JP.EUC-JP) [ext/standard/tests/strings/htmlentities04.phpt]
htmlentities() test 15 (setlocale / KOI8-R) [ext/standard/tests/strings/htmlentities15.phpt]
=====================================================================


[root@server php-5.2.0]# make install
Installing PHP SAPI module:       apache
[activating module `php5' in /usr/local/apache/conf/httpd.conf]
cp libs/libphp5.so /usr/local/apache/libexec/libphp5.so
cp: cannot stat `libs/libphp5.so': No such file or directory
apxs:Break: Command failed with rc=1
make: *** [install-sapi] Error 1
[root@server php-5.2.0]#