rendered paste body/usr/bin/ar: creating units/powerpc64-linux/libptestutils.a
/usr/bin/ar: units/powerpc64-linux/testutils.sl/testutils0s14.o: No such file or directory
testutils.pp(114) Error: Error while linking
testutils.pp(114) Fatal: There were 1 errors compiling module, stopping
Fatal: Compilation aborted
make[3]: *** [fpcunit.ppu] Error 1
make[3]: *** Waiting for unfinished jobs....
/usr/bin/ar: creating units/powerpc64-linux/libpavl_tree.a
/usr/bin/ar: creating units/powerpc64-linux/libphtmldefs.a
make[3]: Leaving directory `/home/thomas/source/fpc.svn/fcl'
make[2]: *** [fpc_smart] Error 2
make[2]: Leaving directory `/home/thomas/source/fpc.svn/fcl'
make[1]: *** [fcl_smart] Error 2
make[1]: Leaving directory `/home/thomas/source/fpc.svn'