All pastes #330173 Raw Edit

Amarok-svn-sqliteerr

public text v1 · immutable
#330173 ·published 2007-01-27 16:04 UTC
rendered paste body

make[4]: Entering directory `/usr/ports/egna/amarok_svn/multimedia/amarok/src/sqlite'
if /bin/sh ../../../libtool --silent --tag=CC --mode=compile gcc -DHAVE_CONFIG_H -I. -I. -I../../..   -DQT_THREAD_SUPPORT  -D_REENTRANT -I/usr/include/qt -I/usr/X11R6/include  -DTHREADSAFE=1 -DHAVE_USLEEP=1 -fno-strict-aliasing -std=iso9899:1990 -W -Wall -Wchar-subscripts -Wshadow -Wpointer-arith -Wmissing-prototypes -Wwrite-strings -D_XOPEN_SOURCE=500 -D_BSD_SOURCE -g3 -fno-inline   -Wformat-security -Wmissing-format-attribute -MT libsqlite_la-os_unix.lo -MD -MP -MF ".deps/libsqlite_la-os_unix.Tpo" -c -o libsqlite_la-os_unix.lo `test -f 'os_unix.c' || echo './'`os_unix.c; \
then mv -f ".deps/libsqlite_la-os_unix.Tpo" ".deps/libsqlite_la-os_unix.Plo"; else rm -f ".deps/libsqlite_la-os_unix.Tpo"; exit 1; fi
In file included from os_unix.c:119:
os_common.h: In function `sqlite3GenericAllocationSize':
os_common.h:187: warning: unused parameter `p'
os_unix.c: In function `sqlite3UnixTempFileName':
os_unix.c:961: warning: comparison between signed and unsigned
os_unix.c: In function `full_fsync':
os_unix.c:1141: warning: unused parameter `fullSync'
os_unix.c:2030:12: missing terminating ' character
os_unix.c: In function `sqlite3UnixThreadSpecificData':
os_unix.c:2792: warning: missing initializer
os_unix.c:2792: warning: (near initialization for `zeroData.useSharedData')
make[4]: *** [libsqlite_la-os_unix.lo] Error 1
make[4]: Leaving directory `/usr/ports/egna/amarok_svn/multimedia/amarok/src/sqlite'
make[3]: *** [all-recursive] Error 1
make[3]: Leaving directory `/usr/ports/egna/amarok_svn/multimedia/amarok/src'
make[2]: *** [all-recursive] Error 1
make[2]: Leaving directory `/usr/ports/egna/amarok_svn/multimedia/amarok'
make[1]: *** [all-recursive] Error 1
make[1]: Leaving directory `/usr/ports/egna/amarok_svn/multimedia'
make: *** [all] Error 2