Compilation succeeded - 4 warning(s)
/usr/bin/mcs -target:library -out:Mono.Debugger.Test.dll -debug -define:DEBUG -nowarn:0169,0067 -keyfile:../build/mono.snk -r:Mono.GetOptions -r:./Mono.Debugger.dll -r:./Mono.Debugger.Frontend.dll -r:nunit.framework ../test/testsuite/*.cs AssemblyInfo.cs
error CS0006: Cannot find assembly `nunit.framework'
Log:
Compilation failed: 1 error(s), 0 warnings
make[2]: *** [Mono.Debugger.Test.dll] Error 1
make[2]: Leaving directory `/home/dats/Desktop/mono-debugger-0.30/build'
make[1]: *** [all-recursive] Error 1
make[1]: Leaving directory `/home/dats/Desktop/mono-debugger-0.30'
make: *** [all] Error 2
instalacion de nunit :
root@pkt:/home/dats/Desktop/mono-debugger-0.30# dpkg -l | grep nunit
ii gnunit 1.1.11-4ubuntu1 frontend for running NUnit 2 test suites
ii gnunit2 1.1.11-4ubuntu1 frontend for running NUnit 2 test suites
ii libnunit-doc 2.2.8-1ubuntu1 Unit test framework for .NET
ii libnunit2.2-cil 2.2.0-3ubuntu2 Unit test framework for .NET
ii libnunit2.2.6-cil 2.2.8-1ubuntu1 Unit test framework for .NET
ii monodevelop-nunit 0.12-0ubuntu2 NUnit plugin for MonoDevelop
ii monodoc-nunit-manual 1.1.17-0ubuntu1 compiled XML documentation for Nunit
ii nunit 2.2.8-1ubuntu1 Unit test framework for .NET
ii nunit-console 2.2.8-1ubuntu1 Unit test framework for .NET